Propanoic acid, 2,3-dichloro-
- Formula: C3H4Cl2O2
- Molecular weight: 142.969
- IUPAC Standard InChIKey: GKFWNPPZHDYVLI-UHFFFAOYSA-N
- CAS Registry Number: 565-64-0
- Chemical structure:
View 3d structure (requires JavaScript / HTML 5) - Other names: Propionic acid, 2,3-dichloro-; α,β-Dichloropropionic acid; 2,3-Dichloropropionic acid; Alpha,beta-dichloropropionic acid; 2,3-Dichloropropanoic acid

Phase change data

Data compiled by: Thermodynamics Research Center, NIST Boulder Laboratories, Chris Muzny director
Quantity | Value | Units | Method | Reference | Comment |
---|---|---|---|---|---|
Tfus | 323. | K | N/A | Anonymous, 1957 | Uncertainty assigned by TRC = 0.6 K |

References

Anonymous, 1957
Anonymous, R.,
, Am. Pet. Inst. Res. Proj. 6, Carnegie-Mellon Univ., 1957. [all data]