CAS Reg. No. 56448-64-7
- CAS Registry Number: 56448-64-7

Reaction thermochemistry data

Data compiled by: John E. Bartmess
Individual Reactions
(CAS Reg. No. 56448-64-7 • 4294967295) +
= CAS Reg. No. 56448-64-7
By formula: (CAS Reg. No. 56448-64-7 • 4294967295Al) + Al = CAS Reg. No. 56448-64-7
Quantity | Value | Units | Method | Reference | Comment |
---|---|---|---|---|---|
ΔrH° | 72.8 ± 7.5 | kcal/mol | N/A | Villalta and Leopold, 2009 | gas phase |

References

Villalta and Leopold, 2009
Villalta, P.W.; Leopold, D.G.,
A study of the ground and excited states of Al-3 and Al-3(-). I. 488 nm anion photoelectron spectrum,
J. Chem. Phys., 2009, 130, 2, 024303, https://doi.org/10.1063/1.2973625
. [all data]