Cyclopentane, (4-octyldodecyl)-
- Formula: C25H50
- Molecular weight: 350.6645
- IUPAC Standard InChIKey: LEMCTUNZNGDMNT-UHFFFAOYSA-N
- CAS Registry Number: 5638-09-5
- Chemical structure:
View 3d structure (requires JavaScript / HTML 5) - Other names: Heptadecane, 9-(3-cyclopentylpropyl)-; 1-Cyclopentyl-4-n-octyldodecane; 9-(3-Cyclopentyl-propyl)-heptadecane

Phase change data

Data compiled as indicated in comments:
TRC - Thermodynamics Research Center, NIST Boulder Laboratories, Chris Muzny director
AC - William E. Acree, Jr., James S. Chickos
Quantity | Value | Units | Method | Reference | Comment |
---|---|---|---|---|---|
Tfus | 252.55 | K | N/A | Anonymous, 1968 | Uncertainty assigned by TRC = 0.5 K; TRC |
Tfus | 252.6 | K | N/A | Anonymous, 1952 | Uncertainty assigned by TRC = 1. K; TRC |
Tfus | 252.6 | K | N/A | Schiessler, 1947 | Uncertainty assigned by TRC = 1. K; TRC |
Enthalpy of vaporization
ΔvapH (kJ/mol) | Temperature (K) | Method | Reference | Comment |
---|---|---|---|---|
86.9 | 491. | A | Stephenson and Malanowski, 1987 | Based on data from 476. to 514. K. See also Dykyj, Svoboda, et al., 1999.; AC |

References

Anonymous, 1968
Anonymous, R.,
Properties of hydrocarbon of high molecular weight, Am. Pet. Inst. Res. Proj. 42, Penn. State Univ., 1968. [all data]
Anonymous, 1952
Anonymous, R.,
, Physical Properties of Chemical Substances, Dow Chemical Co., 1952. [all data]
Schiessler, 1947
Schiessler, R.W.,
, Am. Pet. Inst. Res. Proj. 42, Twelfth Meeting, 1947. [all data]
Stephenson and Malanowski, 1987
Stephenson, Richard M.; Malanowski, Stanislaw,
Handbook of the Thermodynamics of Organic Compounds, 1987, https://doi.org/10.1007/978-94-009-3173-2
. [all data]
Dykyj, Svoboda, et al., 1999
Dykyj, J.; Svoboda, J.; Wilhoit, R.C.; Frenkel, M.L.; Hall, K.R.,
Vapor Pressure of Chemicals: Part A. Vapor Pressure and Antoine Constants for Hydrocarbons and Sulfur, Selenium, Tellurium and Hydrogen Containing Organic Compounds, Springer, Berlin, 1999, 373. [all data]