2-Butene, 2,3-dimethyl-
- Formula: C6H12
- Molecular weight: 84.1595
- IUPAC Standard InChIKey: WGLLSSPDPJPLOR-UHFFFAOYSA-N
- CAS Registry Number: 563-79-1
- Chemical structure:
View 3d structure (requires JavaScript / HTML 5) - Other names: Tetramethylethylene; 1,1,2,2-Tetramethylethylene; 2,3-Dimethyl-2-butene; 2,3-Dimethylbut-2-ene; 2,3-Dimethylbutene-2; (CH3)2C=C(CH3)2; Tetramethylethene

Kovats' RI, non-polar column, isothermal

Column type | Active phase | Temperature (C) | I | Reference | Comment |
---|---|---|---|---|---|
Capillary | Methyl Silicone | 30. | 630.4 | Soják, Addová, et al., 2002 | He; Column length: 150. m; Column diameter: 0.250 mm |
Capillary | Squalane | 30. | 624.2 | Soják, Addová, et al., 2002 | He; Column length: 93. m; Column diameter: 0.250 mm |
Capillary | Squalane | 25. | 624. | Hilal, Carreira, et al., 1994 | |
Capillary | OV-101 | 40. | 630. | Laub and Purnell, 1988 | |
Capillary | OV-101 | 60. | 631. | Laub and Purnell, 1988 | |
Capillary | OV-101 | 80. | 631. | Laub and Purnell, 1988 | |
Capillary | OV-101 | 50. | 630.6 | Boneva and Dimov, 1986 | 100. m/0.27 mm/0.9 μm, N2 |
Capillary | OV-101 | 70. | 631.1 | Boneva and Dimov, 1986 | 100. m/0.27 mm/0.9 μm, N2 |
Capillary | Squalane | 50. | 625.3 | Boneva and Dimov, 1986 | N2; Column length: 100. m; Column diameter: 0.25 mm |
Capillary | Squalane | 70. | 626. | Boneva and Dimov, 1986 | N2; Column length: 100. m; Column diameter: 0.25 mm |
Packed | SE-30 | 42. | 630. | Rudenko, Mal'tsev, et al., 1985 | Column length: 3. m |
Capillary | DB-1 | 40. | 631. | Lubeck and Sutton, 1984 | 60. m/0.264 mm/0.25 μm, H2 |
Capillary | HP-PONA | 40. | 631. | Lubeck and Sutton, 1984 | 50. m/0.21 mm/0.5 μm, H2 |
Capillary | Squalane | 50. | 624.8 | Bajus, Veselý, et al., 1979 | Column length: 100. m; Column diameter: 0.25 mm |
Capillary | Squalane | 70. | 626. | Bajus, Veselý, et al., 1979 | Column length: 100. m; Column diameter: 0.25 mm |
Packed | Squalane | 80. | 626. | Chrétien and Dubois, 1977 | |
Capillary | Squalane | 50. | 625. | Chretien and Dubois, 1976 | |
Capillary | Squalane | 50. | 625. | Rijks, van den Berg, et al., 1974 | |
Capillary | Squalane | 50. | 625. | Rijks, van den Berg, et al., 1974 | |
Capillary | Squalane | 70. | 626. | Rijks, van den Berg, et al., 1974 | |
Capillary | Squalane | 70. | 626. | Rijks, van den Berg, et al., 1974 | |
Capillary | Squalane | 50. | 625. | Rijks and Cramers, 1974 | N2; Column length: 100. m; Column diameter: 0.25 mm |
Capillary | Squalane | 70. | 626. | Rijks and Cramers, 1974 | N2; Column length: 100. m; Column diameter: 0.25 mm |
Capillary | Squalane | 40. | 614. | Matukuma, 1969 | N2; Column length: 91.4 m; Column diameter: 0.25 mm |
Packed | Squalane | 27. | 625. | Hively and Hinton, 1968 | He, Chromosorb P; Column length: 15. m; Column diameter: 0.25 mm |
Packed | Squalane | 49. | 626. | Hively and Hinton, 1968 | He, Chromosorb P; Column length: 15. m; Column diameter: 0.25 mm |
Packed | Squalane | 67. | 627. | Hively and Hinton, 1968 | He, Chromosorb P; Column length: 15. m; Column diameter: 0.25 mm |
Packed | Squalane | 86. | 627. | Hively and Hinton, 1968 | He, Chromosorb P; Column length: 15. m; Column diameter: 0.25 mm |
Capillary | Squalane | 70. | 625. | Schomburg, 1967 | Ar; Column length: 100. m |
Packed | Squalane | 26. | 612. | Zulaïca and Guiochon, 1966 | Column length: 10. m |

Van Den Dool and Kratz RI, non-polar column, temperature ramp

Column type | Active phase | I | Reference | Comment |
---|---|---|---|---|
Capillary | Methyl Silicone | 632.0 | Soják, Addová, et al., 2002 | He, 1. K/min; Column length: 150. m; Column diameter: 0.250 mm; Tstart: 30. C; Tend: 200. C |
Capillary | Petrocol DH | 624.32 | White, Douglas, et al., 1992 | 100. m/0.25 mm/0.5 μm, He, 1. K/min; Tstart: 30. C; Tend: 220. C |
Capillary | Petrocol DH | 624.38 | White, Douglas, et al., 1992 | 100. m/0.25 mm/0.5 μm, He, 1. K/min; Tstart: 30. C; Tend: 220. C |
Capillary | Petrocol DH | 624. | White, Hackett, et al., 1992 | 100. m/0.25 mm/0.5 μm, He, 1. K/min; Tstart: 30. C; Tend: 220. C |

Normal alkane RI, non-polar column, isothermal

Column type | Active phase | Temperature (C) | I | Reference | Comment |
---|---|---|---|---|---|
Capillary | Squalane | 40. | 624.2 | Sojak, Addova, et al., 2000 | He; Column length: 93. m; Column diameter: 0.25 mm |
Capillary | Methyl Silicone | 50. | 625. | N/A | N2; Column length: 74.6 m; Column diameter: 0.28 mm |
Capillary | Squalane | 70. | 625. | Schomburg, 1966 |

Normal alkane RI, non-polar column, temperature ramp

Column type | Active phase | I | Reference | Comment |
---|---|---|---|---|
Capillary | DB-1 | 630. | Ramnas, Ostermark, et al., 1994 | 50. m/0.32 mm/1.0 μm, He, 2. K/min; Tstart: -20. C |

Normal alkane RI, non-polar column, custom temperature program

Column type | Active phase | I | Reference | Comment |
---|---|---|---|---|
Capillary | Methyl Silicone | 627. | Chen and Feng, 2007 | Program: not specified |
Capillary | Polydimethyl siloxane | 626. | Junkes, Castanho, et al., 2003 | Program: not specified |
Capillary | Methyl Silicone | 630. | Zenkevich and Marinichev, 2001 | Program: not specified |
Packed | SE-30 | 649. | Robinson and Odell, 1971 | N2, Chromosorb W; Column length: 6.1 m; Program: 50C910min) => 20C/min => 90(6min) => 10C/min => 150C(hold) |
Packed | Squalane | 631. | Robinson and Odell, 1971 | N2, Embacel; Column length: 3.0 m; Program: 25C(5min) => 2C/min => 35 => 4C/min => 95C(hold) |

Gas phase thermochemistry data

Data compiled as indicated in comments:
ALS - Hussein Y. Afeefy, Joel F. Liebman, and Stephen E. Stein
GT - Glushko Thermocenter, Russian Academy of Sciences, Moscow
Quantity | Value | Units | Method | Reference | Comment |
---|---|---|---|---|---|
ΔfH°gas | -16.80 ± 0.36 | kcal/mol | Eqk | Wiberg and Hao, 1991 | Heat of hydration; ALS |
ΔfH°gas | -16.35 ± 0.35 | kcal/mol | Eqk | Rodgers and Wu, 1971 | Heat of isomerization; ALS |
Constant pressure heat capacity of gas
Cp,gas (cal/mol*K) | Temperature (K) | Reference | Comment |
---|---|---|---|
32.340 ± 0.065 | 334.20 | Scott D.W., 1955 | GT |
33.939 ± 0.067 | 355.25 | ||
36.960 ± 0.074 | 393.20 | ||
40.069 ± 0.081 | 433.20 | ||
43.100 ± 0.086 | 473.20 |
Constant pressure heat capacity of gas
Cp,gas (cal/mol*K) | Temperature (K) | Reference | Comment |
---|---|---|---|
27.710 | 273.15 | Scott D.W., 1955 | Recommended results of statistical thermodynamics calculation are in good agreement with experimental data.; GT |
29.541 | 298.15 | ||
29.680 | 300. | ||
37.481 | 400. | ||
45.041 | 500. | ||
51.781 | 600. | ||
57.670 | 700. | ||
62.780 | 800. | ||
67.249 | 900. | ||
71.140 | 1000. | ||
74.551 | 1100. | ||
77.510 | 1200. | ||
80.079 | 1300. | ||
82.330 | 1400. | ||
84.309 | 1500. |

Condensed phase thermochemistry data

Data compiled as indicated in comments:
ALS - Hussein Y. Afeefy, Joel F. Liebman, and Stephen E. Stein
DH - Eugene S. Domalski and Elizabeth D. Hearing
Quantity | Value | Units | Method | Reference | Comment |
---|---|---|---|---|---|
ΔfH°liquid | -24.60 ± 0.35 | kcal/mol | Eqk | Wiberg and Hao, 1991 | Heat of hydration; ALS |
Quantity | Value | Units | Method | Reference | Comment |
S°liquid | 64.579 | cal/mol*K | N/A | Scott, Finke, et al., 1955 | DH |
S°liquid | 65.11 | cal/mol*K | N/A | Parks, Todd, et al., 1936 | Extrapolation below 90 K, 58.45 J/mol*K.; DH |
Constant pressure heat capacity of liquid
Cp,liquid (cal/mol*K) | Temperature (K) | Reference | Comment |
---|---|---|---|
41.750 | 298.15 | Scott, Finke, et al., 1955 | T = 10 to 320 K.; DH |
42.000 | 295.5 | Parks, Todd, et al., 1936 | T = 83 to 296 K. Value is unsmoothed experimental datum.; DH |

Phase change data

Data compiled as indicated in comments:
BS - Robert L. Brown and Stephen E. Stein
TRC - Thermodynamics Research Center, NIST Boulder Laboratories, Chris Muzny director
AC - William E. Acree, Jr., James S. Chickos
ALS - Hussein Y. Afeefy, Joel F. Liebman, and Stephen E. Stein
CAL - James S. Chickos, William E. Acree, Jr., Joel F. Liebman, Students of Chem 202 (Introduction to the Literature of Chemistry), University of Missouri -- St. Louis
DH - Eugene S. Domalski and Elizabeth D. Hearing
Quantity | Value | Units | Method | Reference | Comment |
---|---|---|---|---|---|
Tboil | 346.3 ± 0.4 | K | AVG | N/A | Average of 28 out of 30 values; Individual data points |
Quantity | Value | Units | Method | Reference | Comment |
Tfus | 198.8 ± 0.3 | K | AVG | N/A | Average of 13 out of 15 values; Individual data points |
Quantity | Value | Units | Method | Reference | Comment |
Ttriple | 198.92 | K | N/A | Scott, Finke, et al., 1955, 2 | Crystal phase 1 phase; Uncertainty assigned by TRC = 0.01 K; TRC |
Ttriple | 198.900 | K | N/A | Waddington, 1951 | Crystal phase 1 phase; Uncertainty assigned by TRC = 0.05 K; TRC |
Ttriple | 198.920 | K | N/A | Waddington, 1951 | Crystal phase 1 phase; Uncertainty assigned by TRC = 0.02 K; TRC |
Ttriple | 198.5 | K | N/A | Parks, Todd, et al., 1936, 2 | Crystal phase 1 phase; Uncertainty assigned by TRC = 0.2 K; TRC |
Quantity | Value | Units | Method | Reference | Comment |
Tc | 524. | K | N/A | Majer and Svoboda, 1985 | |
Quantity | Value | Units | Method | Reference | Comment |
ΔvapH° | 7.808 | kcal/mol | N/A | Majer and Svoboda, 1985 | |
ΔvapH° | 7.77 | kcal/mol | N/A | Reid, 1972 | AC |
ΔvapH° | 7.78 | kcal/mol | V | Camin and Rossini, 1956 | ALS |
ΔvapH° | 7.79 | kcal/mol | N/A | Camin and Rossini, 1956, 2 | Based on data from 289. to 347. K.; AC |
Enthalpy of vaporization
ΔvapH (kcal/mol) | Temperature (K) | Method | Reference | Comment |
---|---|---|---|---|
7.084 | 346.4 | N/A | Majer and Svoboda, 1985 | |
7.67 | 328. | N/A | Uusi-Kyyny, Pokki, et al., 2004 | Based on data from 313. to 346. K.; AC |
7.91 | 297. | A | Stephenson and Malanowski, 1987 | Based on data from 282. to 348. K. See also Bevan, Malkin, et al., 1955.; AC |
7.82 | 304. | N/A | Fried, Baghdoyan, et al., 1971 | Based on data from 289. to 347. K.; AC |
7.86 ± 0.02 | 292. | C | Scott, Finke, et al., 1955 | AC |
7.65 ± 0.02 | 308. | C | Scott, Finke, et al., 1955 | AC |
7.39 ± 0.02 | 326. | C | Scott, Finke, et al., 1955 | AC |
7.10 ± 0.02 | 346. | C | Scott, Finke, et al., 1955 | AC |
Enthalpy of vaporization
ΔvapH =
A exp(-βTr) (1 − Tr)β
ΔvapH =
Enthalpy of vaporization (at saturation pressure)
(kcal/mol)
Tr = reduced temperature (T / Tc)
View plot Requires a JavaScript / HTML 5 canvas capable browser.
Temperature (K) | A (kcal/mol) | β | Tc (K) | Reference | Comment |
---|---|---|---|---|---|
292. to 346. | 11.54 | 0.2801 | 524. | Majer and Svoboda, 1985 |
Antoine Equation Parameters
log10(P) = A − (B / (T + C))
P = vapor pressure (atm)
T = temperature (K)
View plot Requires a JavaScript / HTML 5 canvas capable browser.
Temperature (K) | A | B | C | Reference | Comment |
---|---|---|---|---|---|
289.48 to 347.00 | 3.69897 | 1021.564 | -70.242 | Baghdoyan, Malik, et al., 1971 | Coefficents calculated by NIST from author's data. |
302.18 to 346.36 | 4.09016 | 1224.926 | -46.812 | Scott, Finke, et al., 1955 | Coefficents calculated by NIST from author's data. |
Enthalpy of fusion
ΔfusH (kcal/mol) | Temperature (K) | Reference | Comment |
---|---|---|---|
1.54 | 198.9 | Domalski and Hearing, 1996 | AC |
Entropy of fusion
ΔfusS (cal/mol*K) | Temperature (K) | Reference | Comment |
---|---|---|---|
4.288 | 196.8 | Domalski and Hearing, 1996 | CAL |
7.741 | 198.9 |
Enthalpy of phase transition
ΔHtrs (kcal/mol) | Temperature (K) | Initial Phase | Final Phase | Reference | Comment |
---|---|---|---|---|---|
0.8439 | 196.82 | crystaline, II | crystaline, I | Scott, Finke, et al., 1955 | DH |
1.542 | 198.92 | crystaline, I | liquid | Scott, Finke, et al., 1955 | Enthalpies of transition and fusion calculated from total enthalpy change 196.82 to 198.92 K and assumed Cp of 150 J/mol*K for c,I.; DH |
1.094 | 196.6 | crystaline, II | crystaline, I | Parks, Todd, et al., 1936 | DH |
1.305 | 198.5 | crystaline, I | liquid | Parks, Todd, et al., 1936 | DH |
Entropy of phase transition
ΔStrs (cal/mol*K) | Temperature (K) | Initial Phase | Final Phase | Reference | Comment |
---|---|---|---|---|---|
4.288 | 196.82 | crystaline, II | crystaline, I | Scott, Finke, et al., 1955 | DH |
7.753 | 198.92 | crystaline, I | liquid | Scott, Finke, et al., 1955 | Enthalpies; DH |
5.564 | 196.6 | crystaline, II | crystaline, I | Parks, Todd, et al., 1936 | DH |
6.575 | 198.5 | crystaline, I | liquid | Parks, Todd, et al., 1936 | DH |

Reaction thermochemistry data

Data compiled by: Hussein Y. Afeefy, Joel F. Liebman, and Stephen E. Stein
Individual Reactions
By formula: H2 + C6H12 = C6H14
Quantity | Value | Units | Method | Reference | Comment |
---|---|---|---|---|---|
ΔrH° | -25.98 ± 0.11 | kcal/mol | Chyd | Rogers, Crooks, et al., 1987 | liquid phase |
ΔrH° | -26.39 ± 0.10 | kcal/mol | Chyd | Kistiakowsky, Ruhoff, et al., 1936 | gas phase; Reanalyzed by Cox and Pilcher, 1970, Original value = -26.63 ± 0.10 kcal/mol; At 355 K |
By formula: C6H12 = C6H12
Quantity | Value | Units | Method | Reference | Comment |
---|---|---|---|---|---|
ΔrH° | 1.82 ± 0.12 | kcal/mol | Eqk | Radyuk, Kabo, et al., 1972 | gas phase; At 562 K |
ΔrH° | 1.7 ± 0.2 | kcal/mol | Eqk | Rodgers and Wu, 1971 | gas phase; Heat of isomerization |
By formula: C6H12 = C6H12
Quantity | Value | Units | Method | Reference | Comment |
---|---|---|---|---|---|
ΔrH° | -1.7 ± 0.2 | kcal/mol | Eqk | Rodgers and Wu, 1971 | gas phase; Heat of isomerization |
ΔrH° | -1.8 | kcal/mol | Eqk | Abell, 1966 | gas phase |
By formula: C6H12 + HCl = C6H13Cl
Quantity | Value | Units | Method | Reference | Comment |
---|---|---|---|---|---|
ΔrH° | -12.91 ± 0.33 | kcal/mol | Cm | Arnett and Pienta, 1980 | liquid phase; solvent: Methylene chloride; Hydrochlorination |
By formula: C6H12 = C6H12
Quantity | Value | Units | Method | Reference | Comment |
---|---|---|---|---|---|
ΔrH° | -7.18 ± 0.27 | kcal/mol | Ciso | Bartolo and Rossini, 1960 | liquid phase; Calculated from ΔHc |

Gas phase ion energetics data

Data evaluated as indicated in comments:
HL - Edward P. Hunter and Sharon G. Lias
L - Sharon G. Lias
Data compiled as indicated in comments:
LLK - Sharon G. Lias, Rhoda D. Levin, and Sherif A. Kafafi
RDSH - Henry M. Rosenstock, Keith Draxl, Bruce W. Steiner, and John T. Herron
Quantity | Value | Units | Method | Reference | Comment |
---|---|---|---|---|---|
IE (evaluated) | 8.27 ± 0.01 | eV | N/A | N/A | L |
Quantity | Value | Units | Method | Reference | Comment |
Proton affinity (review) | 194.5 | kcal/mol | N/A | Hunter and Lias, 1998 | HL |
Quantity | Value | Units | Method | Reference | Comment |
Gas basicity | 187.8 | kcal/mol | N/A | Hunter and Lias, 1998 | HL |
Ionization energy determinations
IE (eV) | Method | Reference | Comment |
---|---|---|---|
8.27 ± 0.02 | PE | Bieri, Burger, et al., 1977 | LLK |
8.16 | EI | Lossing and Traeger, 1975 | LLK |
8.271 ± 0.005 | PE | Masclet, Grosjean, et al., 1973 | LLK |
8.26 | PE | Frost and Sandhu, 1971 | LLK |
8.30 | PI | Bralsford, Harris, et al., 1960 | RDSH |
8.30 | PE | Kovac, Mohraz, et al., 1980 | Vertical value; LLK |
10.52 | PE | McAlduff and Houk, 1977 | Vertical value; LLK |
8.46 | PE | Mollere, Houk, et al., 1976 | Vertical value; LLK |
8.42 | PE | Fuss and Bock, 1974 | Vertical value; LLK |
Appearance energy determinations
Ion | AE (eV) | Other Products | Method | Reference | Comment |
---|---|---|---|---|---|
C5H9+ | 8.16 | CH3 | EI | Lossing and Traeger, 1975, 2 | LLK |
C5H9+ | 10.32 | CH3 | EI | Lossing and Traeger, 1975 | LLK |

References

Soják, Addová, et al., 2002
Soják, L.; Addová, G.; Kubinec, R.; Kraus, A.; Hu, G.,
Gas chromatographic-mass spectrometric characterization of all acyclic C5-C7 alkenes from fluid catalytic cracked gasoline using polydimethylsiloxane and squalane stationary phases,
J. Chromatogr. A, 2002, 947, 1, 103-117, https://doi.org/10.1016/S0021-9673(01)01564-3
. [all data]
Hilal, Carreira, et al., 1994
Hilal, S.H.; Carreira, L.A.; Karickhoff, S.W.; Melton, C.M.,
Estimation of Gas-Liquid Chromatographic Retention Times from Molecular Structure,
J. Chromatogr. A, 1994, 662, 2, 269-280, https://doi.org/10.1016/0021-9673(94)80515-6
. [all data]
Laub and Purnell, 1988
Laub, R.J.; Purnell, J.H.,
Specific retention volumes, retention indices, and family-plot regressions of aliphatic, alicyclic, and aromatic hydrocarbon solutes with OV-101 poly (dimethylsiloxane) stationary phase,
J. Hi. Res. Chromatogr. Chromatogr. Comm., 1988, 11, 9, 649-660, https://doi.org/10.1002/jhrc.1240110908
. [all data]
Boneva and Dimov, 1986
Boneva, S.; Dimov, N.,
Gas Chromatographic Retention Indices for Alkenes on OV-101 and Squalane Capillary Columns,
Chromatographia, 1986, 21, 3, 149-151, https://doi.org/10.1007/BF02311743
. [all data]
Rudenko, Mal'tsev, et al., 1985
Rudenko, G.I.; Mal'tsev, V.V.; Studenichnik, V.N.; Ustinov, E.P.,
Gas chromatographic analysis of volatile substances evolved into atmosphere from polymer materials,
Zh. Anal. Khim., 1985, 40, 6, 1119-1127. [all data]
Lubeck and Sutton, 1984
Lubeck, A.J.; Sutton, D.L.,
Kovats Retention Indices of Selected Olefins on Bonded Phase Fused Silica Capillaries,
J. Hi. Res. Chromatogr. Chromatogr. Comm., 1984, 7, 9, 542-544, https://doi.org/10.1002/jhrc.1240070913
. [all data]
Bajus, Veselý, et al., 1979
Bajus, M.; Veselý, V.; Leclercq, P.A.; Rijks, J.A.,
Steam cracking of hydrocarbons. 1. Pyrolysis of heptane,
Ind. Eng. Chem. Prod. Res. Dev., 1979, 18, 1, 30-37, https://doi.org/10.1021/i360069a007
. [all data]
Chrétien and Dubois, 1977
Chrétien, J.R.; Dubois, J.E.,
Topological analysis of gas-liquid chromatographic behavior of alkenes,
Anal. Chem., 1977, 49, 6, 747-756, https://doi.org/10.1021/ac50014a021
. [all data]
Chretien and Dubois, 1976
Chretien, J.R.; Dubois, J.-E.,
New Perspectives in the Prediction of Kovats Indices,
J. Chromatogr., 1976, 126, 171-189, https://doi.org/10.1016/S0021-9673(01)84071-1
. [all data]
Rijks, van den Berg, et al., 1974
Rijks, J.A.; van den Berg, J.H.M.; Diependaal, J.P.,
Characterization of hydrocarbons in complex mixtures by two-dimensional precision gas chromatography,
J. Chromatogr., 1974, 91, 603-612, https://doi.org/10.1016/S0021-9673(01)97941-5
. [all data]
Rijks and Cramers, 1974
Rijks, J.A.; Cramers, C.A.,
High precision capillary gas chromatography of hydrocarbons,
Chromatographia, 1974, 7, 3, 99-106, https://doi.org/10.1007/BF02269819
. [all data]
Matukuma, 1969
Matukuma, A.,
Retention indices of alkanes through C10 and alkenes through C8 and relation between boiling points and retention data,
Gas Chromatogr., Int. Symp. Anal. Instrum. Div Instrum Soc. Amer., 1969, 7, 55-75. [all data]
Hively and Hinton, 1968
Hively, R.A.; Hinton, R.E.,
Variation of the retention index with temperature on squalane substrates,
J. Gas Chromatogr., 1968, 6, 4, 203-217, https://doi.org/10.1093/chromsci/6.4.203
. [all data]
Schomburg, 1967
Schomburg, G.,
Struktur und Retentionsverhalten von Offenkettigen und Cyclischen Kohlenwasserstoffen und Deren Einfacher Substitutionsprodukte,
Anal. Chim. Acta., 1967, 38, 45-64, https://doi.org/10.1016/S0003-2670(01)80560-2
. [all data]
Zulaïca and Guiochon, 1966
Zulaïca, J.; Guiochon, G.,
Analyse des hauts polymères par chromatographie en phase gazeuse de leurs produits de pyrolyse. II. Application à quelques hydrocarbures macromoléculaires purs,
Bull. Soc. Chim. Fr., 1966, 4, 1351-1363. [all data]
White, Douglas, et al., 1992
White, C.M.; Douglas, L.J.; Hackett, J.P.; Anderson, R.R.,
Characterization of synthetic gasoline from the chloromethane-zeolite reaction,
Energy Fuels, 1992, 6, 1, 76-82, https://doi.org/10.1021/ef00031a012
. [all data]
White, Hackett, et al., 1992
White, C.M.; Hackett, J.; Anderson, R.R.; Kail, S.; Spock, P.S.,
Linear temperature programmed retention indices of gasoline range hydrocarbons and chlorinated hydrocarbons on cross-linked polydimethylsiloxane,
J. Hi. Res. Chromatogr., 1992, 15, 2, 105-120, https://doi.org/10.1002/jhrc.1240150211
. [all data]
Sojak, Addova, et al., 2000
Sojak, L.; Addova, G.; Kubinec, R.; Ruman, J.; Hu, G.,
GC-MS characterization of all acyclic C5-C7 alkenes from FCC gasoline using squalane stationary phase,
Petroleum and Coal, 2000, 42, 3-4, 188-194. [all data]
Schomburg, 1966
Schomburg, G.,
Gaschromatographische Retentionsdaten und Struktur Chemischer Verbindungen. II. Methylverzweigungen und Doppelbindungen in Offenkettigen Kohlenwasserstoffen,
J. Chromatogr., 1966, 23, 1-17, https://doi.org/10.1016/S0021-9673(01)98652-2
. [all data]
Ramnas, Ostermark, et al., 1994
Ramnas, O.; Ostermark, U.; Peterson, G.,
Characterization of sixty alkenes in a cat-cracked gasoline naphtha by gas chromatography,
Chromatographia, 1994, 38, 3/4, 222-226, https://doi.org/10.1007/BF02290340
. [all data]
Chen and Feng, 2007
Chen, Y.; Feng, C.,
QSPR study on gas chromatography retention index of some organic pollutants,
Comput. Appl. Chem. (China), 2007, 24, 10, 1404-1408. [all data]
Junkes, Castanho, et al., 2003
Junkes, B.S.; Castanho, R.D.M.; Amboni, C.; Yunes, R.A.; Heinzen, V.E.F.,
Semiempirical Topological Index: A Novel Molecular Descriptor for Quantitative Structure-Retention Relationship Studies,
Internet Electronic Journal of Molecular Design, 2003, 2, 1, 33-49. [all data]
Zenkevich and Marinichev, 2001
Zenkevich, I.G.; Marinichev, A.N.,
Comparison of Topological and Dynamics Molecular Characteristics for Precalculation of Chromatographic Retention Parameters of Organic Compounds (in Russian),
Zh. Struct. Khim., 2001, 42, 5, 893-902. [all data]
Robinson and Odell, 1971
Robinson, P.G.; Odell, A.L.,
A system of standard retention indices and its uses. The characterisation of stationary phases and the prediction of retention indices,
J. Chromatogr., 1971, 57, 1-10, https://doi.org/10.1016/0021-9673(71)80001-8
. [all data]