Hexane, 3,3-dimethyl-
- Formula: C8H18
- Molecular weight: 114.2285
- IUPAC Standard InChIKey: KUMXLFIBWFCMOJ-UHFFFAOYSA-N
- CAS Registry Number: 563-16-6
- Chemical structure:
View 3d structure (requires JavaScript / HTML 5) - Other names: 3,3-Dimethylhexane

Gas phase thermochemistry data

Data compiled by: Hussein Y. Afeefy, Joel F. Liebman, and Stephen E. Stein
Quantity | Value | Units | Method | Reference | Comment |
---|---|---|---|---|---|
ΔfH°gas | -220.1 ± 1.1 | kJ/mol | Ccb | Prosen and Rossini, 1945 |

Condensed phase thermochemistry data

Data compiled as indicated in comments:
ALS - Hussein Y. Afeefy, Joel F. Liebman, and Stephen E. Stein
DH - Eugene S. Domalski and Elizabeth D. Hearing
Quantity | Value | Units | Method | Reference | Comment |
---|---|---|---|---|---|
ΔfH°liquid | -257.7 ± 1.1 | kJ/mol | Ccb | Prosen and Rossini, 1945 | ALS |
Quantity | Value | Units | Method | Reference | Comment |
ΔcH°liquid | -5462.97 ± 0.96 | kJ/mol | Ccb | Prosen and Rossini, 1945 | Corresponding ΔfHºliquid = -257.6 kJ/mol (simple calculation by NIST; no Washburn corrections); ALS |
Constant pressure heat capacity of liquid
Cp,liquid (J/mol*K) | Temperature (K) | Reference | Comment |
---|---|---|---|
246.60 | 298.15 | Osborne and Ginnings, 1947 | T = 278 to 318 K.; DH |

Phase change data

Data compiled as indicated in comments:
BS - Robert L. Brown and Stephen E. Stein
TRC - Thermodynamics Research Center, NIST Boulder Laboratories, Chris Muzny director
AC - William E. Acree, Jr., James S. Chickos
ALS - Hussein Y. Afeefy, Joel F. Liebman, and Stephen E. Stein
Quantity | Value | Units | Method | Reference | Comment |
---|---|---|---|---|---|
Tboil | 385.1 ± 0.4 | K | AVG | N/A | Average of 16 out of 18 values; Individual data points |
Quantity | Value | Units | Method | Reference | Comment |
Tfus | 147.01 ± 0.06 | K | AVG | N/A | Average of 7 values; Individual data points |
Quantity | Value | Units | Method | Reference | Comment |
Tc | 562.0 ± 0.5 | K | N/A | Daubert, 1996 | |
Tc | 561.95 | K | N/A | McMicking and Kay, 1965 | Uncertainty assigned by TRC = 0.4 K; TRC |
Quantity | Value | Units | Method | Reference | Comment |
Pc | 26.5 ± 0.4 | bar | N/A | Daubert, 1996 | |
Pc | 26.534 | bar | N/A | McMicking and Kay, 1965 | Uncertainty assigned by TRC = 0.4053 bar; TRC |
Quantity | Value | Units | Method | Reference | Comment |
Vc | 0.443 | l/mol | N/A | Daubert, 1996 | |
Quantity | Value | Units | Method | Reference | Comment |
ρc | 2.26 ± 0.04 | mol/l | N/A | Daubert, 1996 | |
ρc | 2.26 | mol/l | N/A | McMicking and Kay, 1965 | Uncertainty assigned by TRC = 0.04 mol/l; TRC |
Quantity | Value | Units | Method | Reference | Comment |
ΔvapH° | 37.6 | kJ/mol | N/A | Majer and Svoboda, 1985 | |
ΔvapH° | 37.5 ± 0.1 | kJ/mol | C | Osborne and Ginnings, 1947, 2 | AC |
ΔvapH° | 37.53 | kJ/mol | C | Osborne and Ginnings, 1947 | ALS |
Enthalpy of vaporization
ΔvapH (kJ/mol) | Temperature (K) | Method | Reference | Comment |
---|---|---|---|---|
32.31 | 385.1 | N/A | Majer and Svoboda, 1985 | |
36.6 | 323. | A,MM | Stephenson and Malanowski, 1987 | Based on data from 308. to 386. K. See also Willingham, Taylor, et al., 1945.; AC |
41.2 | 262. | N/A | Stull, 1947 | Based on data from 247. to 385. K.; AC |
Antoine Equation Parameters
log10(P) = A − (B / (T + C))
P = vapor pressure (bar)
T = temperature (K)
View plot Requires a JavaScript / HTML 5 canvas capable browser.
Temperature (K) | A | B | C | Reference | Comment |
---|---|---|---|---|---|
247.4 to 385. | 3.85939 | 1243.387 | -62.655 | Stull, 1947 | Coefficents calculated by NIST from author's data. |

Reaction thermochemistry data

Data compiled by: Hussein Y. Afeefy, Joel F. Liebman, and Stephen E. Stein
Individual Reactions
By formula: C8H18 = C8H18
Quantity | Value | Units | Method | Reference | Comment |
---|---|---|---|---|---|
ΔrH° | -7.74 ± 0.71 | kJ/mol | Ciso | Prosen and Rossini, 1945, 2 | liquid phase; Calculated from ΔHc |

Henry's Law data

Data compiled by: Rolf Sander
Henry's Law constant (water solution)
kH(T) = k°H exp(d(ln(kH))/d(1/T) ((1/T) - 1/(298.15 K)))
k°H = Henry's law constant for solubility in water at 298.15 K (mol/(kg*bar))
d(ln(kH))/d(1/T) = Temperature dependence constant (K)
k°H (mol/(kg*bar)) | d(ln(kH))/d(1/T) (K) | Method | Reference | Comment |
---|---|---|---|---|
0.00026 | Q | N/A | missing citation give several references for the Henry's law constants but don't assign them to specific species. |

Kovats' RI, non-polar column, isothermal

Column type | Active phase | Temperature (C) | I | Reference | Comment |
---|---|---|---|---|---|
Capillary | OV-101 | 40. | 738.6 | Chen, Liang, et al., 2001 | He; Column length: 50. m; Column diameter: 0.25 mm |
Capillary | OV-101 | 60. | 741.1 | Chen, Liang, et al., 2001 | He; Column length: 50. m; Column diameter: 0.25 mm |
Capillary | OV-101 | 0. | 737. | Skrbic, 1997 | |
Capillary | OV-101 | 0. | 737. | Skrbic, 1997 | |
Packed | Squalane | 78.5 | 747.6 | Zhang and Lu, 1996 | |
Capillary | Squalane | 25. | 740. | Hilal, Carreira, et al., 1994 | |
Capillary | DB-1 | 60. | 742.9 | Krupcik, Skacani, et al., 1994 | H2; Phase thickness: 0.25 μm |
Capillary | PONA | 60. | 742.8 | Krupcik, Skacani, et al., 1994 | H2; Phase thickness: 0.5 μm |
Capillary | PONA | 60. | 743.0 | Krupcik, Skacani, et al., 1994 | H2; Phase thickness: 0.5 μm |
Capillary | DB-1 | 60. | 743.0 | Krupcik, Skacani, et al., 1994 | H2; Phase thickness: 1. μm |
Capillary | OV-101 | 60. | 743.0 | Krupcik, Skacani, et al., 1994 | H2; Phase thickness: 0.2 μm |
Capillary | OV-1 | 60. | 743. | Engewald, Maurer, et al., 1989 | |
Capillary | OV-1 | 45. | 741.2 | Guan, Kiraly, et al., 1989 | 25. m/0.31 mm/0.52 μm, He |
Capillary | OV-1 | 65. | 744. | Guan, Kiraly, et al., 1989 | 25. m/0.31 mm/0.52 μm, He |
Capillary | OV-101 | 40. | 739. | Laub and Purnell, 1988 | |
Capillary | OV-101 | 60. | 741. | Laub and Purnell, 1988 | |
Capillary | OV-101 | 80. | 743. | Laub and Purnell, 1988 | |
Capillary | Squalane | 50. | 743.1 | Lunskii and Paizanskaya, 1988 | He; Column length: 50. m; Column diameter: 0.22 mm |
Capillary | Squalane | 70. | 745.2 | Lunskii and Paizanskaya, 1988 | He; Column length: 50. m; Column diameter: 0.22 mm |
Capillary | Nonpolar | 45. | 743. | Stoyanov and Dimov, 1987 | |
Capillary | Nonpolar | 52.5 | 744. | Stoyanov and Dimov, 1987 | |
Capillary | Nonpolar | 60. | 745. | Stoyanov and Dimov, 1987 | |
Capillary | OV-101 | 40. | 740.4 | Boneva and Dimov, 1986 | 100. m/0.27 mm/0.9 μm |
Capillary | OV-101 | 50. | 741.2 | Boneva and Dimov, 1986 | 100. m/0.27 mm/0.9 μm |
Capillary | OV-101 | 60. | 741.8 | Boneva and Dimov, 1986 | 100. m/0.27 mm/0.9 μm |
Capillary | OV-101 | 70. | 742.9 | Boneva and Dimov, 1986 | 100. m/0.27 mm/0.9 μm |
Capillary | OV-101 | 30. | 738. | Chien, Furio, et al., 1983 | |
Capillary | OV-101 | 40. | 739. | Chien, Furio, et al., 1983 | |
Capillary | OV-101 | 50. | 740. | Chien, Furio, et al., 1983 | |
Capillary | OV-101 | 60. | 741. | Chien, Furio, et al., 1983 | |
Capillary | OV-101 | 70. | 742. | Chien, Furio, et al., 1983 | |
Capillary | OV-101 | 80. | 743. | Chien, Furio, et al., 1983 | |
Capillary | DB-1 | 60. | 742.9 | Lubeck and Sutton, 1983 | Column length: 60. m; Column diameter: 0.264 mm |
Capillary | DB-1 | 60. | 743. | Lubeck and Sutton, 1983 | 60. m/0.259 mm/1. μm |
Capillary | Squalane | 50. | 743.3 | Bajus, Veselý, et al., 1979 | Column length: 100. m; Column diameter: 0.25 mm |
Packed | Triacontane | 80. | 746. | Castello and D'Amato, 1979 | He, Chromosorb W AW (60-80 mesh); Column length: 3. m |
Packed | Squalane | 80. | 746. | Castello and D'Amato, 1979 | He, Chromosorb W AW (60-80 mesh); Column length: 3. m |
Capillary | Squalane | 86. | 747.4 | Nabivach and Kirilenko, 1979 | N2; Column length: 50. m |
Capillary | Squalane | 86. | 748.7 | Nabivach and Kirilenko, 1979 | N2; Column length: 50. m |
Capillary | Squalane | 60. | 745. | Chretien and Dubois, 1976 | |
Capillary | Squalane | 50. | 744. | Rijks and Cramers, 1974 | N2; Column length: 100. m; Column diameter: 0.25 mm |
Capillary | Squalane | 70. | 746. | Rijks and Cramers, 1974 | N2; Column length: 100. m; Column diameter: 0.25 mm |
Packed | SF-96 | 100. | 747.6 | Castello, Berg, et al., 1973 | Chromosorb P(DMCS); Column length: 4. m |
Packed | SF-96 | 110. | 749.57 | Castello, Berg, et al., 1973 | Chromosorb P(DMCS); Column length: 4. m |
Packed | SF-96 | 120. | 751.28 | Castello, Berg, et al., 1973 | Chromosorb P(DMCS); Column length: 4. m |
Packed | SF-96 | 80. | 744.29 | Castello, Berg, et al., 1973 | Chromosorb P(DMCS); Column length: 4. m |
Packed | SF-96 | 90. | 745.86 | Castello, Berg, et al., 1973 | Chromosorb P(DMCS); Column length: 4. m |
Capillary | OV-101 | 50. | 742. | Pacáková, Hoch, et al., 1973 | 25. m/0.25 mm/1.39 μm, N2 |
Capillary | OV-101 | 60. | 743. | Pacáková, Hoch, et al., 1973 | 25. m/0.25 mm/1.39 μm, N2 |
Capillary | Vacuum Grease Oil (VM-4) | 35. | 739. | Sidorov, Petrova, et al., 1972 | |
Capillary | Vacuum Grease Oil (VM-4) | 45. | 741. | Sidorov, Petrova, et al., 1972 | |
Capillary | Vacuum Grease Oil (VM-4) | 50. | 742. | Sidorov, Petrova, et al., 1972 | |
Capillary | Vacuum Grease Oil (VM-4) | 58. | 743. | Sidorov, Petrova, et al., 1972 | |
Capillary | Vacuum Grease Oil (VM-4) | 68. | 744. | Sidorov, Petrova, et al., 1972 | |
Capillary | Squalane | 70. | 743.7 | Dimov and Schopov, 1971 | Column length: 100. m; Column diameter: 0.25 mm |
Packed | SE-30 | 80. | 746. | Mitra and Saha, 1970 | N2 |
Packed | Squalane | 25. | 740. | Mitra and Saha, 1970 | N2 |
Packed | Squalane | 80. | 747. | Mitra and Saha, 1970 | N2 |
Capillary | Squalane | 40. | 742. | Matukuma, 1969 | N2; Column length: 91.4 m; Column diameter: 0.25 mm |
Packed | Squalane | 27. | 740. | Hively and Hinton, 1968 | He, Chromosorb P; Column length: 15. m; Column diameter: 0.25 mm |
Packed | Squalane | 49. | 744. | Hively and Hinton, 1968 | He, Chromosorb P; Column length: 15. m; Column diameter: 0.25 mm |
Packed | Squalane | 67. | 746. | Hively and Hinton, 1968 | He, Chromosorb P; Column length: 15. m; Column diameter: 0.25 mm |
Packed | Squalane | 86. | 748. | Hively and Hinton, 1968 | He, Chromosorb P; Column length: 15. m; Column diameter: 0.25 mm |
Packed | Squalane | 30. | 741. | Tourres, 1967 | H2; Column length: 10. m |
Packed | Squalane | 50. | 743.5 | Tourres, 1967 | H2; Column length: 10. m |
Capillary | Squalane | 30. | 741. | Tourres, 1967, 2 | H2; Column length: 100. m; Column diameter: 0.25 mm |
Capillary | Squalane | 50. | 744. | Tourres, 1967, 2 | H2; Column length: 100. m; Column diameter: 0.25 mm |
Capillary | Squalane | 70. | 746. | Tourres, 1967, 2 | H2; Column length: 100. m; Column diameter: 0.25 mm |
Packed | Squalane | 40. | 742. | Evans, 1966 | Untreated celite; Column length: 1.8 m |
Packed | Squalane | 55. | 744. | Evans, 1966 | Untreated celite; Column length: 1.8 m |
Packed | Squalane | 70. | 746. | Evans, 1966 | Untreated celite; Column length: 1.8 m |

Kovats' RI, non-polar column, temperature ramp

Column type | Active phase | I | Reference | Comment |
---|---|---|---|---|
Capillary | OV-101 | 735. | Hayes and Pitzer, 1982 | 110. m/0.25 mm/0.20 μm, He, 1. K/min; Tstart: 35. C; Tend: 200. C |
Capillary | Apiezon L | 742. | Louis, 1971 | N2, 1. K/min; Column length: 50. m; Column diameter: 0.25 mm; Tstart: 60. C |

Kovats' RI, non-polar column, custom temperature program

Column type | Active phase | I | Reference | Comment |
---|---|---|---|---|
Capillary | Petrocol DH-100 | 738.3 | Haagen-Smit Laboratory, 1997 | He; Column length: 100. m; Column diameter: 0.2 mm; Program: 5C(10min) => 5C/min => 50C(48min) => 1.5C/min => 195C(91min) |

Van Den Dool and Kratz RI, non-polar column, temperature ramp

Column type | Active phase | I | Reference | Comment |
---|---|---|---|---|
Capillary | Petrocol DH | 741.6 | Censullo, Jones, et al., 2003 | 50. m/0.25 mm/0.5 μm, He, 35. C @ 10. min, 3. K/min, 200. C @ 10. min |
Capillary | SPB-1 | 735.27 | LECO Corporation, 2003 | 30. m/0.25 mm/0.25 μm, 40. C @ 2. min, 10. K/min, 250. C @ 2. min |
Capillary | SPB-1 | 735.71 | LECO Corporation, 2003 | 30. m/0.25 mm/0.25 μm, 40. C @ 2. min, 10. K/min, 250. C @ 2. min |
Capillary | OV-101 | 739.2 | Yin, Liu, et al., 2001 | N2, 1. K/min; Column length: 80. m; Column diameter: 0.22 mm; Tstart: 30. C; Tend: 130. C |
Capillary | Petrocol DH | 736.36 | Subramaniam, Bochniak, et al., 1994 | 100. m/0.25 mm/0.5 μm, He, 1. K/min; Tstart: 30. C; Tend: 220. C |
Capillary | Petrocol DH | 736.45 | Subramaniam, Bochniak, et al., 1994 | 100. m/0.25 mm/0.5 μm, He, 1. K/min; Tstart: 30. C; Tend: 220. C |
Capillary | Petrocol DH | 743. | White, Hackett, et al., 1992 | 100. m/0.25 mm/0.5 μm, He, 1. K/min; Tstart: 30. C; Tend: 220. C |
Capillary | OV-101 | 735. | Hayes and Pitzer, 1981 | 108. m/0.25 mm/0.2 μm, 1. K/min; Tstart: 35. C; Tend: 200. C |

Van Den Dool and Kratz RI, non-polar column, custom temperature program

Column type | Active phase | I | Reference | Comment |
---|---|---|---|---|
Capillary | OV-101 | 739. | Wu and Lu, 1984 | Program: not specified |

Normal alkane RI, non-polar column, isothermal

Column type | Active phase | Temperature (C) | I | Reference | Comment |
---|---|---|---|---|---|
Capillary | OV-101 | 40. | 740. | Li and Deng, 1998 | N2; Column length: 51. m; Column diameter: 0.25 mm |
Capillary | Methyl Silicone | 50. | 744. | N/A | N2; Column length: 74.6 m; Column diameter: 0.28 mm |
Capillary | OV-101 | 50. | 741. | Wu and Lu, 1984, 2 | |
Capillary | OV-101 | 70. | 743. | Wu and Lu, 1984, 2 | |
Capillary | Squalane | 100. | 750. | Dimov N., 1976 | |
Capillary | Squalane | 70. | 746. | Dimov N., 1976 | |
Capillary | Squalane | 86. | 736. | Vigdergauz and Martynov, 1971 | He; Column length: 150. m; Column diameter: 0.35 mm |

Normal alkane RI, non-polar column, temperature ramp

Column type | Active phase | I | Reference | Comment |
---|---|---|---|---|
Capillary | Polydimethyl siloxane: CP-Sil 5 CB | 742. | Bramston-Cook, 2013 | 60. m/0.25 mm/1.0 μm, Helium, 45. C @ 1.45 min, 3.6 K/min, 210. C @ 2.72 min |
Capillary | PONA | 743. | Zhang, Ding, et al., 2009 | 50. m/0.20 mm/0.50 μm, Nitrogen, 35. C @ 15. min, 2. K/min, 200. C @ 10. min |

Normal alkane RI, non-polar column, custom temperature program

Column type | Active phase | I | Reference | Comment |
---|---|---|---|---|
Capillary | Methyl Silicone | 748. | Chen and Feng, 2007 | Program: not specified |
Capillary | Methyl Silicone | 744. | Feng and Mu, 2007 | Program: not specified |
Capillary | OV-101 | 745. | Du and Liang, 2003 | Program: not specified |
Capillary | Polydimethyl siloxanes | 739. | Yin, Guo, et al., 2001 | Program: not specified |
Capillary | Methyl Silicone | 738. | Spieksma, 1999 | Program: not specified |
Capillary | OV-101 | 737. | Skrbic and Cvejanov, 1993 | Program: not specified |
Capillary | Squalane | 740. | Petrov, 1984 | Program: not specified |
Capillary | OV-1, SE-30, Methyl silicone, SP-2100, OV-101, DB-1, etc. | 741. | Waggott and Davies, 1984 | Hydrogen; Column length: 50. m; Column diameter: 0.32 mm; Program: not specified |

References

Prosen and Rossini, 1945
Prosen, E.J.; Rossini, F.D.,
Heats of combustion and formation of the paraffin hydrocarbons at 25° C,
J. Res. NBS, 1945, 263-267. [all data]
Osborne and Ginnings, 1947
Osborne, N.S.; Ginnings, D.C.,
Measurements of heat of vaporization and heat capacity of a number of hydrocarbons,
J. Res. NBS, 1947, 39, 453-477. [all data]
Daubert, 1996
Daubert, T.E.,
Vapor-Liquid Critical Properties of Elements and Compounds. 5. Branched Alkanes and Cycloalkanes,
J. Chem. Eng. Data, 1996, 41, 365-372. [all data]
McMicking and Kay, 1965
McMicking, J.H.; Kay, W.B.,
Vapor Pressures and Saturated Liquid and Vapor Densities of The Isomeric Heptanes and Isomeric Octanes,
Proc., Am. Pet. Inst., Sect. 3, 1965, 45, 75-90. [all data]
Majer and Svoboda, 1985
Majer, V.; Svoboda, V.,
Enthalpies of Vaporization of Organic Compounds: A Critical Review and Data Compilation, Blackwell Scientific Publications, Oxford, 1985, 300. [all data]
Osborne and Ginnings, 1947, 2
Osborne, Nathan S.; Ginnings, Defoe C.,
Measurements of heat of vaporization and heat capacity of a number of hydrocarbons,
J. RES. NATL. BUR. STAN., 1947, 39, 5, 453-17, https://doi.org/10.6028/jres.039.031
. [all data]
Stephenson and Malanowski, 1987
Stephenson, Richard M.; Malanowski, Stanislaw,
Handbook of the Thermodynamics of Organic Compounds, 1987, https://doi.org/10.1007/978-94-009-3173-2
. [all data]
Willingham, Taylor, et al., 1945
Willingham, C.B.; Taylor, W.J.; Pignocco, J.M.; Rossini, F.D.,
Vapor pressures and boiling points of some paraffin, alkylcyclopentane, alkylcyclohexane, and alkylbenzene hydrocarbons,
J. RES. NATL. BUR. STAN., 1945, 35, 3, 219-17, https://doi.org/10.6028/jres.035.009
. [all data]
Stull, 1947
Stull, Daniel R.,
Vapor Pressure of Pure Substances. Organic and Inorganic Compounds,
Ind. Eng. Chem., 1947, 39, 4, 517-540, https://doi.org/10.1021/ie50448a022
. [all data]
Prosen and Rossini, 1945, 2
Prosen, E.J.; Rossini, F.D.,
Heats of isomerization of the 18 octanes,
J. Res. NBS, 1945, 34, 163-174. [all data]
Chen, Liang, et al., 2001
Chen, J.P.; Liang, X.M.; Zhang, Q.; Zhang, L.F.,
Prediction of GC retention values under various column temperature conditions from temperature programmed data,
Chromatographia, 2001, 53, 9/10, 539-547, https://doi.org/10.1007/BF02491619
. [all data]
Skrbic, 1997
Skrbic, B.D.,
Unified retention concept -- statistical treatment of Kováts retention index,
J. Chromatogr. A, 1997, 764, 2, 257-264, https://doi.org/10.1016/S0021-9673(96)00955-7
. [all data]
Zhang and Lu, 1996
Zhang, X.; Lu, P.,
Unified equation between Kováts indices on different stationary phases for select types of compounds,
J. Chromatogr. A, 1996, 731, 1-2, 187-199, https://doi.org/10.1016/0021-9673(95)01213-3
. [all data]
Hilal, Carreira, et al., 1994
Hilal, S.H.; Carreira, L.A.; Karickhoff, S.W.; Melton, C.M.,
Estimation of Gas-Liquid Chromatographic Retention Times from Molecular Structure,
J. Chromatogr. A, 1994, 662, 2, 269-280, https://doi.org/10.1016/0021-9673(94)80515-6
. [all data]
Krupcik, Skacani, et al., 1994
Krupcik, J.; Skacani, I.; Benicka, E.; Sandra, P.,
Dependence of gas chromatographic retention data of hydrocarbons on the film thickness of the polydimethylsiloxane stationary phase,
Collect. Czech. Chem. Commun., 1994, 59, 11, 2390-2396, https://doi.org/10.1135/cccc19942390
. [all data]
Engewald, Maurer, et al., 1989
Engewald, W.; Maurer, T.; Schiefke, A.,
Investigation of isomeric hydrocarbons by gas-solid chromatography on graphitized thermal carbon black,
Pure Appl. Chem., 1989, 61, 11, 2001-2004, https://doi.org/10.1351/pac198961112001
. [all data]
Guan, Kiraly, et al., 1989
Guan, Y.; Kiraly, J.; Rijks, J.A.,
Interactive retention index database for compound identification in temperature-programmed capillary gas chromatography,
J. Chromatogr., 1989, 472, 129-143, https://doi.org/10.1016/S0021-9673(00)94101-3
. [all data]
Laub and Purnell, 1988
Laub, R.J.; Purnell, J.H.,
Specific retention volumes, retention indices, and family-plot regressions of aliphatic, alicyclic, and aromatic hydrocarbon solutes with OV-101 poly (dimethylsiloxane) stationary phase,
J. Hi. Res. Chromatogr. Chromatogr. Comm., 1988, 11, 9, 649-660, https://doi.org/10.1002/jhrc.1240110908
. [all data]
Lunskii and Paizanskaya, 1988
Lunskii, M.Kh.; Paizanskaya, I.L.,
Identification of hydrocarbons C1-C9 of petrol fractions of oils and condensates in the use of capillary columns with dinonylphthalate,
Zh. Anal. Khim., 1988, 43, 127-135. [all data]
Stoyanov and Dimov, 1987
Stoyanov, E.; Dimov, N.,
Precalculation of the optimum column temperature for gas chromatographic separation of petroleum fractions,
Anal. Chim. Acta., 1987, 201, 207-216, https://doi.org/10.1016/S0003-2670(00)85338-6
. [all data]
Boneva and Dimov, 1986
Boneva, S.; Dimov, N.,
Unified retention index of hydrocarbons separated on dimethylsilicone OV-101,
Chromatographia, 1986, 21, 12, 697-700, https://doi.org/10.1007/BF02313682
. [all data]
Chien, Furio, et al., 1983
Chien, C.-F.; Furio, D.L.; Kopecni, M.M.; Laub, R.J.,
Specific Retention Volumes and Retention Indices of Selected Hydrocarbon Solutes with OV-101 and SP-2100 Polydimethylsiloxane Solvents,
J. Hi. Res. Chromatogr. Chromatogr. Comm., 1983, 6, 10, 577-580, https://doi.org/10.1002/jhrc.1240061013
. [all data]
Lubeck and Sutton, 1983
Lubeck, A.J.; Sutton, DL.,
Kovats retention indices of selected hydrocarbons through C10 on bonded phase fused silica capillaries,
J. Hi. Res. Chromatogr. Chromatogr. Comm., 1983, 6, 6, 328-332, https://doi.org/10.1002/jhrc.1240060612
. [all data]
Bajus, Veselý, et al., 1979
Bajus, M.; Veselý, V.; Leclercq, P.A.; Rijks, J.A.,
Steam cracking of hydrocarbons. 2. Pyrolysis of methylcyclohexane,
Ind. Eng. Chem. Prod. Res. Dev., 1979, 18, 2, 135-142, https://doi.org/10.1021/i360070a012
. [all data]
Castello and D'Amato, 1979
Castello, G.; D'Amato, G.,
Use of Linear and Branched-Chain Paraffinic Liquid Phases as Non-Polar Reference Materials in Gas Chromatography,
J. Chromatogr., 1979, 175, 1, 27-35, https://doi.org/10.1016/S0021-9673(00)86400-6
. [all data]
Nabivach and Kirilenko, 1979
Nabivach, V.M.; Kirilenko, A.V.,
The use of retention indices for identifying the components of crude benzene,
Solid Fuel Chem. (Engl. Transl.), 1979, 13, 3, 82-87. [all data]
Chretien and Dubois, 1976
Chretien, J.R.; Dubois, J.-E.,
New Perspectives in the Prediction of Kovats Indices,
J. Chromatogr., 1976, 126, 171-189, https://doi.org/10.1016/S0021-9673(01)84071-1
. [all data]
Rijks and Cramers, 1974
Rijks, J.A.; Cramers, C.A.,
High precision capillary gas chromatography of hydrocarbons,
Chromatographia, 1974, 7, 3, 99-106, https://doi.org/10.1007/BF02269819
. [all data]
Castello, Berg, et al., 1973
Castello, G.; Berg, M.; Lunardelli, M.,
Temperature dependence of the retention indices of branched-chain paraffins on non-polar stationary phases. A method for its calculation on the basis of molecular structure,
J. Chromatogr., 1973, 79, 23-31, https://doi.org/10.1016/S0021-9673(01)85270-5
. [all data]
Pacáková, Hoch, et al., 1973
Pacáková, V.; Hoch, K.; Smolková, E.,
The Effect of Instrumentation on the Precision of Retention Indexes,
Chromatographia, 1973, 6, 7, 320-324, https://doi.org/10.1007/BF02269334
. [all data]
Sidorov, Petrova, et al., 1972
Sidorov, R.I.; Petrova, V.I.; Ivanova, M.P.,
Qualitative analysis of wide-boiling fraction C5-C10 with capillary chromatography
in Processes in chromatographic columns. Vol.17, 1972, 14-25. [all data]
Dimov and Schopov, 1971
Dimov, N.; Schopov, D.,
Empirische korrektion der physikalisch-chemischen retentionsindexe von kohlenwasserstoffen auf squalan,
J. Chromatogr., 1971, 63, 223-228, https://doi.org/10.1016/S0021-9673(01)85634-X
. [all data]
Mitra and Saha, 1970
Mitra, G.D.; Saha, N.C.,
Determination of Retention Indices of Saturated Hydrocarbons by Graphical Methods,
J. Chromatogr. Sci., 1970, 8, 2, 95-102, https://doi.org/10.1093/chromsci/8.2.95
. [all data]
Matukuma, 1969
Matukuma, A.,
Retention indices of alkanes through C10 and alkenes through C8 and relation between boiling points and retention data,
Gas Chromatogr., Int. Symp. Anal. Instrum. Div Instrum Soc. Amer., 1969, 7, 55-75. [all data]
Hively and Hinton, 1968
Hively, R.A.; Hinton, R.E.,
Variation of the retention index with temperature on squalane substrates,
J. Gas Chromatogr., 1968, 6, 4, 203-217, https://doi.org/10.1093/chromsci/6.4.203
. [all data]
Tourres, 1967
Tourres, D.A.,
Structural analysis of industrial butene dimers by gas chromatography,
J. Gas Chromatogr., 1967, 5, 1, 35-40, https://doi.org/10.1093/chromsci/5.1.35
. [all data]
Tourres, 1967, 2
Tourres, D.A.,
Structure moléculaire et rétention en chromatographie en phase gazeuse. Influence de la température sur l'indice de rétention d'alcanes isomères,
J. Chromatogr., 1967, 30, 357-377, https://doi.org/10.1016/S0021-9673(00)84168-0
. [all data]
Evans, 1966
Evans, M.B.,
Retention indices of solutes on squalane, dinonyl phthalate, and polyethylene glycol 400,
J. Gas Chromatogr., 1966, 4, 1, 1-3, https://doi.org/10.1093/chromsci/4.1.1
. [all data]
Hayes and Pitzer, 1982
Hayes, P.C., Jr.; Pitzer, E.W.,
Characterizing petroleum- and shale-derived jet fuel distillates via temperature-programmed Kováts indices,
J. Chromatogr., 1982, 253, 179-198, https://doi.org/10.1016/S0021-9673(01)88376-X
. [all data]
Louis, 1971
Louis, R.,
Kovats-index-tafeln zur gaschromatographischen analyse von kohlenwasserstoffgemischen,
Erdoel Kohle Erdgas Petrochem., 1971, 24, 2, 88-94. [all data]
Haagen-Smit Laboratory, 1997
Haagen-Smit Laboratory,
Procedure for the detailed hydrocarbon analysis of gasolines by single column high efficiency (capillary) column gas chromatography, SOP NO. MLD 118, Revision No. 1.1, California Environmental Protection Agency, Air Resources Board, El Monte, California, 1997, 22. [all data]
Censullo, Jones, et al., 2003
Censullo, A.C.; Jones, D.R.; Wills, M.T.,
Speciation of the volatile organic compounds (VOCs) in solventborne aerosol coatings by solid phase microextraction-gas chromatography,
J. Coat. Technol., 2003, 75, 936, 47-53, https://doi.org/10.1007/BF02697922
. [all data]
LECO Corporation, 2003
LECO Corporation,
Determination of hydrocarbon components in petroleum naphthas, 2003, retrieved from http://www.leco.org/customersupport/apps/separationscience/-190.pdf. [all data]
Yin, Liu, et al., 2001
Yin, C.; Liu, W.; Li, Z.; Pan, Z.; Lin, T.; Zhang, M.,
Chemometrics to chemical modeling: structural coding in hydrocarbons and retention indices of gas chromatography,
J. Sep. Sci., 2001, 24, 3, 213-220, https://doi.org/10.1002/1615-9314(20010301)24:3<213::AID-JSSC213>3.0.CO;2-4
. [all data]
Subramaniam, Bochniak, et al., 1994
Subramaniam, B.; Bochniak, D.; Snavely, K.,
Fischer-Tropsch synthesis in supercritical reaction media, Lawrence Department of Chemical and Petroleum Engineering (DOE/PC/92532--T7), United States Department of Energy, Pittsburgh, PA, 1994, 8, retrieved from http://www.NTIS.gov. [all data]
White, Hackett, et al., 1992
White, C.M.; Hackett, J.; Anderson, R.R.; Kail, S.; Spock, P.S.,
Linear temperature programmed retention indices of gasoline range hydrocarbons and chlorinated hydrocarbons on cross-linked polydimethylsiloxane,
J. Hi. Res. Chromatogr., 1992, 15, 2, 105-120, https://doi.org/10.1002/jhrc.1240150211
. [all data]
Hayes and Pitzer, 1981
Hayes, P.C., Jr.; Pitzer, E.W.,
Kovats indices as a tool in characterizing hydrocarbon fuels in temperature programmed glass capillary gas chromatography. Part 1. Qualitative identification, Inhouse rpt. for Air Force Wright Aeronautical Labs., Air Force Wright Aeronautical Labs., Wright-Patterson AFB, Ohio, 1981, 75. [all data]
Wu and Lu, 1984
Wu, J.; Lu, W.,
Hydrocarbon analysis by open-tubular column chromatography with programmed temperature for straight run gasoline,
Anal. Chem., 1984, 12, 7, 572-578. [all data]
Li and Deng, 1998
Li, H.; Deng, C.,
Qualitative analysis of light components of gasoline cracking using Kovats retention indices,
J. Instrumental Analysis, 1998, 17, 1, 67-69. [all data]
Wu and Lu, 1984, 2
Wu, J.; Lu, W.,
Kovats indices of C4-C10 hydrocarbons in apolar quartz capillary OV-101,
Chin. J. Chromatogr., 1984, 1, 1, 11-17. [all data]
Dimov N., 1976
Dimov N.,
Quantitative gas chromatographic analysis and determination of solute properties. An exact equation for the calculation of the retention indices of isoalkanes on Squalane,
J. Chromatogr., 1976, 119, 109-118, https://doi.org/10.1016/S0021-9673(00)86775-8
. [all data]
Vigdergauz and Martynov, 1971
Vigdergauz, M.S.; Martynov, A.A.,
Some applications of the gas chromatographic linear retention indices,
Chromatographia, 1971, 4, 10, 463-467, https://doi.org/10.1007/BF02268816
. [all data]
Bramston-Cook, 2013
Bramston-Cook, R.,
Kovats indices for C2-C13 hydrocarbons and selected oxygenated/halocarbons with 100 % dimethylpolysiloxane columns, 2013, retrieved from http://lotusinstruments.com/monographs/List .... [all data]
Zhang, Ding, et al., 2009
Zhang, X.; Ding, L.; Sun, Z.; Song, L.; Sun, T.,
Study on quantitative structure-retention relationships for hydrocarbons in FCC gasoline,
Chromatographia, 2009, 70, 3/4, 511-518, https://doi.org/10.1365/s10337-009-1174-0
. [all data]
Chen and Feng, 2007
Chen, Y.; Feng, C.,
QSPR study on gas chromatography retention index of some organic pollutants,
Comput. Appl. Chem. (China), 2007, 24, 10, 1404-1408. [all data]
Feng and Mu, 2007
Feng, H.; Mu, L.-L.,
Quantitative structure-retention relationships for alkane and its derivatives based on electrotopological state index and molecular shape index,
Chem. Ind. Engineering (Chinese), 2007, 24, 2, 161-168. [all data]
Du and Liang, 2003
Du, Y.; Liang, Y.,
Data mining for seeking accurate quantitative relationship between molecular structure and GC retention indices of alkanes by projection pursuit,
Comput. Biol. Chem., 2003, 27, 3, 339-353, https://doi.org/10.1016/S1476-9271(02)00081-6
. [all data]
Yin, Guo, et al., 2001
Yin, C.; Guo, W.; Lin, T.; Liu, S.; Fu, R.; Pan, Z.; Wang, L.,
Application of wavelet neural network to the prediction of gas chromatographic retention indices of alkanes,
J. Chinese Chem. Soc., 2001, 48, 739-749. [all data]
Spieksma, 1999
Spieksma, W.,
Determination of vapor liquid equilibrium from the Kovats retention index on dimethylsilicone using the Wilson mixing tool,
J. Hi. Res. Chromatogr., 1999, 22, 10, 565-588, https://doi.org/10.1002/(SICI)1521-4168(19991001)22:10<565::AID-JHRC565>3.0.CO;2-2
. [all data]
Skrbic and Cvejanov, 1993
Skrbic, B.D.; Cvejanov, J.Dj.,
Correlation of unified retention indices for OV-101 and squalane,
Chromatographia, 1993, 35, 1/2, 109-110, https://doi.org/10.1007/BF02278566
. [all data]
Petrov, 1984
Petrov, A.A.,
Hydrocarbons of petroleum, Nauka (publishing house), Moscow, 1984, 263. [all data]
Waggott and Davies, 1984
Waggott, A.; Davies, I.W.,
Identification of organic pollutants using linear temperature programmed retention indices (LTPRIs) - Part II, 1984, retrieved from http://dwi.defra.gov.uk/research/completed-research/reports/dwi0383.pdf. [all data]