Ethanolamine, 3TMS derivative
- Formula: C11H31NOSi3
- Molecular weight: 277.6264
- IUPAC Standard InChIKey: MZTOEZRSUGVLOG-UHFFFAOYSA-N
- CAS Registry Number: 5630-81-9
- Chemical structure:
View 3d structure (requires JavaScript / HTML 5) - Other names: Silanamine, 1,1,1-trimethyl-N-(trimethylsilyl)-N-[2-[(trimethylsilyl)oxy]ethyl]-; 3-Oxa-6-aza-2,7-disilaoctane, 2,2,7,7-tetramethyl-6-(trimethylsilyl)-; Aminoethanol, O,N,N-tris-TMS; Ethanolamine, N,N-bis(trimethylsilyl)-, trimethylsilyl ether; Trimethyl-N-(trimethylsilyl)-N-(2-[(trimethylsilyl)oxy]ethyl)silanamine; Ethanolamine, 3TMS

Van Den Dool and Kratz RI, non-polar column, custom temperature program

Column type | Active phase | I | Reference | Comment |
---|---|---|---|---|
Capillary | Polydimethyl siloxane with 5 % phenyl groups | 1258. | Kempa, Hummel, et al., 2009 | Program: not specified |
Capillary | VF-5MS | 1265.5 | Tret'yakov, 2008 | 30. m/0.25 mm/0.25 μm, He; Program: Multi-step temperature program; T(initial)=60C; T(final)=270C |
Capillary | Methyl Silicone | 1281. | Peng, Yang, et al., 1991 | Program: not specified |

Normal alkane RI, non-polar column, custom temperature program

Column type | Active phase | I | Reference | Comment |
---|---|---|---|---|
Capillary | Polydimethyl siloxane | 1259. | Supplemental Table S3, 2012 | Program: not specified |
Capillary | RTx-5 Sil MS | 1269. | Birkemeier and Kopka, 2007 | 30. m/0.25 mm/0.25 μm, Helium; Program: 70 0C (1 min) 1 0C/min -> 76 0C 6.09 0C/min -> 350 0C (1 min) -> 330 0C (10 min) |

References

Kempa, Hummel, et al., 2009
Kempa, S.; Hummel, J.; Schwemmer, T.; Pietzke, M.; Strehmel, N.; Wienkoop, S.; Kopka, J.; Weckwerth, W.,
An automated GCxGC-TOF-MS protocol for batch-wise extraction and alinmebt of mass isotopomer matrixes from differential 13C-labeling experiments: a case study for photoautotrophic-mixotrophic grown Chlamydomonas reinhardtii cells,
J. Basic Microbiol., 2009, 49, 1, 82-91, https://doi.org/10.1002/jobm.200800337
. [all data]
Tret'yakov, 2008
Tret'yakov, K.V.,
Retention Data. NIST Mass Spectrometry Data Center., NIST Mass Spectrometry Data Center, 2008. [all data]
Peng, Yang, et al., 1991
Peng, C.T.; Yang, Z.C.; Maltby, D.,
Prediction of retention indexes. III. Silylated derivatives of polar compounds,
J. Chromatogr., 1991, 586, 1, 113-129, https://doi.org/10.1016/0021-9673(91)80029-G
. [all data]
Supplemental Table S3, 2012
Supplemental Table S3,
Manually identified analytes present in all three independent not-lethal salt stress acclimation experiments, 2012, retrieved from www.plosone.org/article/fetchSingleRepresentation.action?uri. [all data]
Birkemeier and Kopka, 2007
Birkemeier, C.; Kopka, J.,
Design of metabolite recovery by variations of the metabolite profiling protocol
in Concepts in Plant Metabolomics, Nikolau, B.J.; Wurtele, E.S., ed(s)., Springer, Dordrecht, Netheralnds, 2007, 45-69. [all data]