1,3,4,5-tetrahydroxycyclohexanecarboxylic acid
- Formula: C7H12O6
- Molecular weight: 192.1666
- IUPAC Standard InChIKey: AAWZDTNXLSGCEK-UHFFFAOYSA-N
- CAS Registry Number: 562-73-2
- Chemical structure:
View 3d structure (requires JavaScript / HTML 5) - Species with the same structure:
- Other names: cyclohexanecarboxylic acid, 1,3,4,5-tetrahydroxy-

Phase change data

Data compiled by: Thermodynamics Research Center, NIST Boulder Laboratories, Chris Muzny director
Quantity | Value | Units | Method | Reference | Comment |
---|---|---|---|---|---|
Tc | 665.55 | K | N/A | Kay and Pak, 1980 | Uncertainty assigned by TRC = 0.06 K; Visual, TE cal. vs PRT. Table 2, mercury interface at room temperature. |
Tc | 664.85 | K | N/A | Kay and Pak, 1980 | Uncertainty assigned by TRC = 0.06 K; Visual, TE cal. vs PRT. Table 2, mercury interface at sample temperature. |
Quantity | Value | Units | Method | Reference | Comment |
Pc | 34.426 | bar | N/A | Kay and Pak, 1980 | Uncertainty assigned by TRC = 0.0034 bar; Visual, Table 2, mercury interface at room temperature. |
Pc | 36.108 | bar | N/A | Kay and Pak, 1980 | Uncertainty assigned by TRC = 0.0036 bar; Visual, Table 2, mercury interface at sample temperat |

References

Kay and Pak, 1980
Kay, W.B.; Pak, S.C.,
Determination of the critical constants of high-boiling hydrocarbons. Experiments with gallium as a containing fluid,
J. Chem. Thermodyn., 1980, 12, 673. [all data]