Benzene, (1-tetradecylpentadecyl)-
- Formula: C35H64
- Molecular weight: 484.8827
- IUPAC Standard InChIKey: YNXOIJANZCYQIZ-UHFFFAOYSA-N
- CAS Registry Number: 56247-97-3
- Chemical structure:
View 3d structure (requires JavaScript / HTML 5) - Other names: 15-Phenylnonacosane

Phase change data

Data compiled as indicated in comments:
TRC - Thermodynamics Research Center, NIST Boulder Laboratories, Chris Muzny director
AC - William E. Acree, Jr., James S. Chickos
Quantity | Value | Units | Method | Reference | Comment |
---|---|---|---|---|---|
Tfus | 319.6 | K | N/A | Anonymous, 1968 | Uncertainty assigned by TRC = 0.5 K; TRC |
Enthalpy of vaporization
ΔvapH (kJ/mol) | Temperature (K) | Method | Reference | Comment |
---|---|---|---|---|
126.5 | 536. | A,MG | Stephenson and Malanowski, 1987 | Based on data from 523. to 550. K. See also Schiessler and Whitmore, 1955.; AC |

References

Anonymous, 1968
Anonymous, R.,
Properties of hydrocarbon of high molecular weight, Am. Pet. Inst. Res. Proj. 42, Penn. State Univ., 1968. [all data]
Stephenson and Malanowski, 1987
Stephenson, Richard M.; Malanowski, Stanislaw,
Handbook of the Thermodynamics of Organic Compounds, 1987, https://doi.org/10.1007/978-94-009-3173-2
. [all data]
Schiessler and Whitmore, 1955
Schiessler, R.W.; Whitmore, F.C.,
Properties of High Molecular Weight Hydrocarbons,
Ind. Eng. Chem., 1955, 47, 8, 1660-1665, https://doi.org/10.1021/ie50548a054
. [all data]