Pyrene, 4-decyl-1,2,3,6,7,8-hexahydro-
- Formula: C26H36
- Molecular weight: 348.5640
- IUPAC Standard InChIKey: RJQGNYIKTOWQRO-UHFFFAOYSA-N
- CAS Registry Number: 56247-94-0
- Chemical structure:
View 3d structure (requires JavaScript / HTML 5) - Other names: 4-n-Decyl-(1,2,3,6,7,8-hexahydropyrene)

Phase change data

Data compiled by: Thermodynamics Research Center, NIST Boulder Laboratories, Chris Muzny director
Quantity | Value | Units | Method | Reference | Comment |
---|---|---|---|---|---|
Tfus | 345.65 | K | N/A | Anonymous, 1968 | Uncertainty assigned by TRC = 0.5 K |

References

Anonymous, 1968
Anonymous, R.,
Properties of hydrocarbon of high molecular weight, Am. Pet. Inst. Res. Proj. 42, Penn. State Univ., 1968. [all data]