Sn(Me)3(OH)
- Formula: C3H10OSn
- Molecular weight: 180.821
- CAS Registry Number: 56-24-6

Phase change data

Data compiled by: José A. Martinho Simões
Quantity | Value | Units | Method | Reference | Comment |
---|---|---|---|---|---|
ΔsubH° | 62.8 | kJ/mol | RSC | Baldwin, Lappert, et al., 1972 |

Reaction thermochemistry data

Data compiled by: José A. Martinho Simões
Individual Reactions
C9H27NSn3 (cr) + ( • 55
) (solution) + 3
(l) = (
• 55
) (solution) + 3C3H10OSn (cr)
By formula: C9H27NSn3 (cr) + (HCl • 55H2O) (solution) + 3H2O (l) = (H4ClN • 55H2O) (solution) + 3C3H10OSn (cr)
Quantity | Value | Units | Method | Reference | Comment |
---|---|---|---|---|---|
ΔrH° | -293.7 ± 1.3 | kJ/mol | RSC | Baldwin, Lappert, et al., 1972 |
C3H9BrSn (cr) + (l) = (
• 55
) (solution) + C3H10OSn (cr)
By formula: C3H9BrSn (cr) + H2O (l) = (HBr • 55H2O) (solution) + C3H10OSn (cr)
Quantity | Value | Units | Method | Reference | Comment |
---|---|---|---|---|---|
ΔrH° | -10.0 ± 0.8 | kJ/mol | RSC | Baldwin, Lappert, et al., 1972 |
(cr) +
(l) = C3H10OSn (cr) + (
• 55
) (solution)
By formula: C3H9ClSn (cr) + H2O (l) = C3H10OSn (cr) + (HCl • 55H2O) (solution)
Quantity | Value | Units | Method | Reference | Comment |
---|---|---|---|---|---|
ΔrH° | -13.8 ± 0.4 | kJ/mol | RSC | Baldwin, Lappert, et al., 1972 |
C3H9ISn (l) + (l) = (
• 55
) (solution) + C3H10OSn (cr)
By formula: C3H9ISn (l) + H2O (l) = (HI • 55H2O) (solution) + C3H10OSn (cr)
Quantity | Value | Units | Method | Reference | Comment |
---|---|---|---|---|---|
ΔrH° | -17.6 ± 0.4 | kJ/mol | RSC | Baldwin, Lappert, et al., 1972 |
C5H14OSn (l) + (l) = C3H10OSn (cr) + (
• 55
) (solution)
By formula: C5H14OSn (l) + H2O (l) = C3H10OSn (cr) + (C2H6O • 55H2O) (solution)
Quantity | Value | Units | Method | Reference | Comment |
---|---|---|---|---|---|
ΔrH° | -76.6 ± 1.7 | kJ/mol | RSC | Baldwin, Lappert, et al., 1972 |

Condensed phase thermochemistry data

Data compiled by: José A. Martinho Simões
Quantity | Value | Units | Method | Reference | Comment |
---|---|---|---|---|---|
ΔfH°solid | -379.8 ± 4.1 | kJ/mol | Review | Martinho Simões | The enthalpy of formation relies on -130.6 ± 4.1 kJ/mol for the enthalpy of formation of Sn(Me)3(I)(l). |

Gas phase thermochemistry data

Data compiled by: José A. Martinho Simões

Quantity Value Units Method Reference Comment
Δfgas-317.0kJ/molReviewMartinho SimõesThe enthalpy of formation relies on -130.6 ± 4.1 kJ/mol for the enthalpy of formation of Sn(Me)3(I)(l).

References

Baldwin, Lappert, et al., 1972
Baldwin, J.C.; Lappert, M.F.; Pedley, J.B.; Poland, J.S.,
J. Chem. Soc., Dalton Trans., 1972, 1943.. [all data]