Methyl myristoleate
- Formula: C15H28O2
- Molecular weight: 240.3816
- IUPAC Standard InChIKey: RWIPSJUSVXDVPB-SREVYHEPSA-N
- CAS Registry Number: 56219-06-8
- Chemical structure:

Condensed phase thermochemistry data

Data compiled by: Hussein Y. Afeefy, Joel F. Liebman, and Stephen E. Stein
Quantity | Value | Units | Method | Reference | Comment |
---|---|---|---|---|---|
ΔcH°liquid | -2208.00 ± 0.37 | kcal/mol | Ccb | Freedman, Bagby, et al., 1989 | Corresponding ΔfHºliquid = -159.18 kcal/mol (simple calculation by NIST; no Washburn corrections) |

Phase change data

Data compiled by: William E. Acree, Jr., James S. Chickos
Quantity | Value | Units | Method | Reference | Comment |
---|---|---|---|---|---|
ΔvapH° | 20.8 ± 0.2 | kcal/mol | CGC | Lipkind, Kapustin, et al., 2007 |

Kovats' RI, non-polar column, isothermal

Column type | Active phase | Temperature (C) | I | Reference | Comment |
---|---|---|---|---|---|
Capillary | CP Sil 5 CB | 240. | 1691. | Hanai and Hong, 1989 | 30. m/0.25 mm/0.25 μm |
Capillary | DB-1 | 240. | 1703. | Hanai and Hong, 1989 | 30. m/0.25 mm/0.25 μm |
Packed | SE-30 | 200. | 1695. | Golovnya, Uralets, et al., 1976 | Gas Chrom Q (80-100 mesh); Column length: 1.5 m |

Kovats' RI, polar column, isothermal

Column type | Active phase | Temperature (C) | I | Reference | Comment |
---|---|---|---|---|---|
Capillary | CP-Wax | 240. | 2052. | Hanai and Hong, 1989 | 25. m/0.25 mm/0.22 μm |
Capillary | DB-Wax | 240. | 2000. | Hanai and Hong, 1989 | 25. m/0.25 mm/0.22 μm |

Van Den Dool and Kratz RI, non-polar column, custom temperature program

Column type | Active phase | I | Reference | Comment |
---|---|---|---|---|
Capillary | VF-5MS | 1715.1 | Tret'yakov, 2007 | 30. m/0.25 mm/0.25 μm, He; Program: Multi-step temperature program; T(initial)=60C; T(final)=270C |

Normal alkane RI, non-polar column, temperature ramp

Column type | Active phase | I | Reference | Comment |
---|---|---|---|---|
Capillary | BPX-5 | 1715. | Dickschat, Bode, et al., 2005 | 25. m/0.22 mm/0.25 μm, He, 50. C @ 5. min, 5. K/min; Tend: 300. C |
Capillary | Ultra-1 | 1689. | Okumura, 1991 | 25. m/0.32 mm/0.25 μm, He, 3. K/min; Tstart: 80. C; Tend: 260. C |

References

Freedman, Bagby, et al., 1989
Freedman, B.; Bagby, M.O.; Khoury, H.,
Correlation of heats of combustion with empirical formulas for fatty alcohols,
J. Am. Oil Chem. Soc., 1989, 66, 595-596. [all data]
Lipkind, Kapustin, et al., 2007
Lipkind, Dmitry; Kapustin, Yaroslav; Umnahanant, Patamaporn; Chickos, James S.,
The vaporization enthalpies and vapor pressures of a series of unsaturated fatty acid methyl esters by correlation gas chromatography,
Thermochimica Acta, 2007, 456, 2, 94-101, https://doi.org/10.1016/j.tca.2007.02.008
. [all data]
Hanai and Hong, 1989
Hanai, T.; Hong, C.,
Structure-retention correlation in CGC,
J. Hi. Res. Chromatogr., 1989, 12, 5, 327-332, https://doi.org/10.1002/jhrc.1240120517
. [all data]
Golovnya, Uralets, et al., 1976
Golovnya, R.V.; Uralets, V.P.; Kuzmenko, T.E.,
Characterization of fatty acid methyl esters by gas chromatography on siloxane liquid phases,
J. Chromatogr., 1976, 121, 1, 118-121, https://doi.org/10.1016/S0021-9673(00)82312-2
. [all data]
Tret'yakov, 2007
Tret'yakov, K.V.,
Retention Data. NIST Mass Spectrometry Data Center., NIST Mass Spectrometry Data Center, 2007. [all data]
Dickschat, Bode, et al., 2005
Dickschat, J.S.; Bode, H.B.; Kroppenstedt, R.M.; Müller, R.; Schulz, S.,
Biosynthesis of iso-fatty acids in myxobacteria,
Org. Biomol. Chem., 2005, 3, 15, 2824-2831, https://doi.org/10.1039/b504889c
. [all data]
Okumura, 1991
Okumura, T.,
retention indices of environmental chemicals on methyl silicone capillary column,
Journal of Environmental Chemistry (Japan), 1991, 1, 2, 333-358, https://doi.org/10.5985/jec.1.333
. [all data]