Methanone, [5-chloro-2-(methylamino)phenyl](2-chlorophenyl)-
- Formula: C14H11Cl2NO
- Molecular weight: 280.149
- IUPAC Standard InChIKey: DQYHYPVCQHTLRO-UHFFFAOYSA-N
- CAS Registry Number: 5621-86-3
- Chemical structure:
View 3d structure (requires JavaScript / HTML 5) - Other names: Benzophenone, 2',5-dichloro-2-methylamino-; 2-Methylamino-2',5-dichlorobenzophenone; 2-methylamino-2',5-dichlor-benzophenone; 2-Methylamino-5,2'-dichlorobenzophenone; Lormetazepam, hydrolysis; 2',5-dichloro-2-(methylamino)benzophenone

Kovats' RI, non-polar column, isothermal

Column type | Active phase | Temperature (C) | I | Reference | Comment |
---|---|---|---|---|---|
Capillary | BP-1 | 200. | 2196. | Japp, Garthwaite, et al., 1988 | 25. m/0.22 mm/0.25 μm, N2 |
Capillary | HP-1 | 200. | 2185. | Japp, Garthwaite, et al., 1988 | 30. m/0.53 mm/0.88 μm, N2 |
Packed | SE-30 | 280. | 2185. | Schütz, 1982 | N2 |

Kovats' RI, non-polar column, temperature ramp

Column type | Active phase | I | Reference | Comment |
---|---|---|---|---|
Capillary | Cross-Linked Methylsilicone | 2220. | Maurer and Pfleger, 1987 | 12. m/0.2 mm/0.33 μm, He, 100. C @ 3. min, 30. K/min, 310. C @ 5. min |

Normal alkane RI, non-polar column, custom temperature program

Column type | Active phase | I | Reference | Comment |
---|---|---|---|---|
Capillary | HP-5MS | 2220. | Augsburger, Rivier, et al., 1998 | 30. m/0.25 mm/0.25 μm; Program: not specified |

References

Japp, Garthwaite, et al., 1988
Japp, M.; Garthwaite, K.; Geeson, A.V.; Osselton, M.D.,
Collection of Analytical Data for Benzodiazepines and Benzophenones,
J. Chromatogr., 1988, 439, 2, 317-339, https://doi.org/10.1016/S0021-9673(01)83844-9
. [all data]
Schütz, 1982
Schütz, H.,
Benzodiazepines, Springer-Verlag, New York, 1982, 438. [all data]
Maurer and Pfleger, 1987
Maurer, H.; Pfleger, K.,
Identification and differentiation of benzodiazepines and their metabolites in urine by computerized gas chromatography-mass spectrometry,
J. Chromatogr., 1987, 422, 85-101, https://doi.org/10.1016/0378-4347(87)80442-5
. [all data]
Augsburger, Rivier, et al., 1998
Augsburger, M.; Rivier, L.; Mangin, P.,
Comparison of different immunoassays and GC-MS screening of benzodiazepines in urine,
J. Pharm. Biomed. Anal., 1998, 18, 4-5, 681-687, https://doi.org/10.1016/S0731-7085(98)00266-0
. [all data]