3,3'-Iminobispropylamine
- Formula: C6H17N3
- Molecular weight: 131.2193
- IUPAC Standard InChIKey: OTBHHUPVCYLGQO-UHFFFAOYSA-N
- CAS Registry Number: 56-18-8
- Chemical structure:
View 3d structure (requires JavaScript / HTML 5) - Other names: Bis(3-aminopropyl)amine; 3,3'-Diaminodipropylamine; 4-Azaheptamethylenediamine; 1,3-Propanediamine, N-(3-aminopropyl)-; 3,3'-Iminopropylamine; Aminobis(propylamine); Caldine; Dipropylamine, 3,3'-diamino-; Imino-bis(3-propylamine); Iminobis(propylamine); N-(3-Aminopropyl)-1,3-propanediamine; N-3-Aminopropyl-1,3-diaminopropane; P 2 (hardener); Propylamine, 3,3'-iminobis-; 1-Propanamine, 3,3'-iminobis-; 1,7-Diamino-4-azaheptane; 4-Azaheptane-1,7-diamine; 3,3-Diaminodipropylamine; Dipropylentriamin; UN 2269; Dipropylene triamine; 1,3-Propanediamine, N1-(3-aminopropyl)-; 3,3'-Iminodi(propylamine); Norspermidine; NSC 7773

Phase change data

Data compiled as indicated in comments:
BS - Robert L. Brown and Stephen E. Stein
TRC - Thermodynamics Research Center, NIST Boulder Laboratories, Chris Muzny director
Quantity | Value | Units | Method | Reference | Comment |
---|---|---|---|---|---|
Tfus | 267.1 | K | N/A | Anonymous, 1958 | Uncertainty assigned by TRC = 0.6 K; TRC |
Tfus | 258.37 | K | N/A | Witschonke, 1954 | Metastable crystal phase; Uncertainty assigned by TRC = 0.35 K; TRC |
Tfus | 258.6 | K | N/A | Witschonke, 1954 | Metastable crystal phase; Uncertainty assigned by TRC = 0.25 K; TRC |
Tfus | 267.93 | K | N/A | Witschonke, 1954 | Crystal phase 1 phase; Uncertainty assigned by TRC = 0.3 K; TRC |
Tfus | 268.15 | K | N/A | Witschonke, 1954 | Crystal phase 1 phase; Uncertainty assigned by TRC = 0.2 K; TRC |
Reduced pressure boiling point
Tboil (K) | Pressure (bar) | Reference | Comment |
---|---|---|---|
424.2 | 0.067 | Weast and Grasselli, 1989 | BS |

Kovats' RI, polar column, isothermal

Column type | Active phase | Temperature (C) | I | Reference | Comment |
---|---|---|---|---|---|
Packed | PEG-2000 | 179. | 1960. | Anderson, Jurel, et al., 1973 | He, Celite 545 (44-60 mesh); Column length: 3. m |
Packed | PEG-2000 | 180. | 1948. | Anderson, Jurel, et al., 1973 | He, Celite 545 (44-60 mesh); Column length: 3. m |
Packed | PEG-2000 | 200. | 1930. | Anderson, Jurel, et al., 1973 | He, Celite 545 (44-60 mesh); Column length: 3. m |
Packed | PEG-2000 | 200. | 1948. | Anderson, Jurel, et al., 1973 | He, Celite 545 (44-60 mesh); Column length: 3. m |

References

Anonymous, 1958
Anonymous, R.,
, Am. Pet. Inst. Res. Proj. 45, Ohio State Univ., 1958. [all data]
Witschonke, 1954
Witschonke, C.R.,
Freezing point and purity data for some organic compounds,
Anal. Chem., 1954, 26, 562-4. [all data]
Weast and Grasselli, 1989
CRC Handbook of Data on Organic Compounds, 2nd Editon, Weast,R.C and Grasselli, J.G., ed(s)., CRC Press, Inc., Boca Raton, FL, 1989, 1. [all data]
Anderson, Jurel, et al., 1973
Anderson, A.; Jurel, S.; Shymanska, M.; Golender, L.,
Gas-liquid chromatography of some aliphatic and heterocyclic mono- and pollyfunctional amines. VII. Retention indices of amines in some polar and unpolar stationary phases,
Latv. PSR Zinat. Akad. Vestis Kim. Ser., 1973, 1, 51-63. [all data]