Cyclopentane, heptyl-
- Formula: C12H24
- Molecular weight: 168.3190
- IUPAC Standard InChIKey: BOFNAOHMSHEKQL-UHFFFAOYSA-N
- CAS Registry Number: 5617-42-5
- Chemical structure:
View 3d structure (requires JavaScript / HTML 5) - Other names: heptylcyclopentane; n-Heptylcyclopentane

Gas phase thermochemistry data

Data compiled by: Hussein Y. Afeefy, Joel F. Liebman, and Stephen E. Stein
Quantity | Value | Units | Method | Reference | Comment |
---|---|---|---|---|---|
ΔfH°gas | -230.1 ± 1.8 | kJ/mol | Ccb | Prosen, Johnson, et al., 1946 | Heat of combustion of the gas |

Condensed phase thermochemistry data

Data compiled by: Hussein Y. Afeefy, Joel F. Liebman, and Stephen E. Stein
Quantity | Value | Units | Method | Reference | Comment |
---|---|---|---|---|---|
ΔcH°liquid | -7922.1 ± 1.6 | kJ/mol | Ccb | Prosen, Johnson, et al., 1946 | Heat of combustion of the gas; Corresponding ΔfHºliquid = -230.0 kJ/mol (simple calculation by NIST; no Washburn corrections) |

Phase change data

Data compiled as indicated in comments:
TRC - Thermodynamics Research Center, NIST Boulder Laboratories, Chris Muzny director
AC - William E. Acree, Jr., James S. Chickos
Quantity | Value | Units | Method | Reference | Comment |
---|---|---|---|---|---|
Tboil | 497.07 | K | N/A | Mears, Stanley, et al., 1963 | Uncertainty assigned by TRC = 0.2 K; TRC |
Tboil | 497.07 | K | N/A | Jessup and Stanley, 1961 | Uncertainty assigned by TRC = 0.5 K; TRC |
Quantity | Value | Units | Method | Reference | Comment |
Tfus | 212.11 | K | N/A | Mears, Stanley, et al., 1963 | Uncertainty assigned by TRC = 0.2 K; TRC |
Tfus | 212.11 | K | N/A | Jessup and Stanley, 1961 | Uncertainty assigned by TRC = 0.5 K; TRC |
Quantity | Value | Units | Method | Reference | Comment |
ΔvapH° | 60.8 | kJ/mol | N/A | Reid, 1972 | AC |

References

Prosen, Johnson, et al., 1946
Prosen, E.J.; Johnson, W.H.; Rossini, F.D.,
Heats of formation and combustion of the normal alkylcyclopentanes and cyclohexanes and the increment per CH2 group for several homologous series of hydrocarbons,
J. Res. NBS, 1946, 37, 51-56. [all data]
Mears, Stanley, et al., 1963
Mears, T.W.; Stanley, C.L.; Compere, E.L.; Howard, F.L.,
Synthesis, purification, and physical properties of seven twelve-carbon hyd rocarbons,
J. Res. Natl. Bur. Stand., Sect. A, 1963, 67, 475. [all data]
Jessup and Stanley, 1961
Jessup, R.S.; Stanley, C.L.,
Heats and volumes of mixing in several c(12) hydrocarbon systems,
J. Chem. Eng. Data, 1961, 6, 368-71. [all data]
Reid, 1972
Reid, Robert C.,
Handbook on vapor pressure and heats of vaporization of hydrocarbons and related compounds, R. C. Wilhort and B. J. Zwolinski, Texas A Research Foundation. College Station, Texas(1971). 329 pages.$10.00,
AIChE J., 1972, 18, 6, 1278-1278, https://doi.org/10.1002/aic.690180637
. [all data]