Heptaethylene glycol
- Formula: C14H30O8
- Molecular weight: 326.3832
- IUPAC Standard InChIKey: XPJRQAIZZQMSCM-UHFFFAOYSA-N
- CAS Registry Number: 5617-32-3
- Chemical structure:
View 3d structure (requires JavaScript / HTML 5) - Other names: 3,6,9,12,15,18-Hexaoxaeicosane-1,20-diol; 2-[2-[2-[2-[2-[2-(2-Hydroxyethoxy)ethoxy]ethoxy]ethoxy]ethoxy]ethoxy]ethanol; 3,6,9,12,15,18-hexaoxaicosane-1,20-diol

Phase change data

Data compiled by: Thermodynamics Research Center, NIST Boulder Laboratories, Chris Muzny director
Quantity | Value | Units | Method | Reference | Comment |
---|---|---|---|---|---|
Tfus | 280.85 | K | N/A | Gallaugher and Hibbert, 1936 | Uncertainty assigned by TRC = 0.7 K |

Van Den Dool and Kratz RI, non-polar column, temperature ramp

Column type | Active phase | I | Reference | Comment |
---|---|---|---|---|
Capillary | Ultra-2 | 2364. | Poskrobko, Linkiewicz, et al., 1994 | 25. m/0.32 mm/0.52 μm, H2, 8. K/min; Tstart: 50. C; Tend: 310. C |

Van Den Dool and Kratz RI, non-polar column, custom temperature program

Column type | Active phase | I | Reference | Comment |
---|---|---|---|---|
Capillary | VF-5MS | 2364.6 | Zheng and White, 2008 | 30. m/0.25 mm/0.25 μm, He; Program: not specified |

References

Gallaugher and Hibbert, 1936
Gallaugher, A.F.; Hibbert, H.,
Studies on reactions relating to carbohydrates and polysaccharides: xlix molecular weight, molar refraction, freezing point and other properties of the polyethylene glycols and their derivatives,
J. Am. Chem. Soc., 1936, 58, 813. [all data]
Poskrobko, Linkiewicz, et al., 1994
Poskrobko, J.; Linkiewicz, M.; Jaworski, M.,
Analysis of high-boiling ethoxylates of methyl, ethyl and butyl alcohols, with the use of gas chromatography,
Chem. Anal. (Warsaw), 1994, 39, 2, 153-159. [all data]
Zheng and White, 2008
Zheng, Y.; White, E.,
Retention Data. NIST Mass Spectrometry Data Center., NIST Mass Spectrometry Data Center, 2008. [all data]