o-Nitrosonitrobenzene dimer
- Formula: C12H8N4O6
- Molecular weight: 304.2151
- IUPAC Standard InChIKey: LWSFKRORNVCQMT-BUHFOSPRSA-N
- CAS Registry Number: 56079-22-2
- Chemical structure:
View 3d structure (requires JavaScript / HTML 5) - Permanent link for this species. Use this link for bookmarking this species for future reference.

Gas phase thermochemistry data

Data compiled by: Hussein Y. Afeefy, Joel F. Liebman, and Stephen E. Stein
Quantity | Value | Units | Method | Reference | Comment |
---|---|---|---|---|---|
ΔfH°gas | 313. ± 4. | kJ/mol | Ccb | Pepekin, Lebedev, et al., 1975 |

Condensed phase thermochemistry data

Data compiled by: Hussein Y. Afeefy, Joel F. Liebman, and Stephen E. Stein
Quantity | Value | Units | Method | Reference | Comment |
---|---|---|---|---|---|
ΔfH°solid | 217. ± 3. | kJ/mol | Ccb | Pepekin, Lebedev, et al., 1975 | |
Quantity | Value | Units | Method | Reference | Comment |
ΔcH°solid | -6082. ± 3. | kJ/mol | Ccb | Pepekin, Lebedev, et al., 1975 |

Phase change data

Data compiled as indicated in comments:
ALS - Hussein Y. Afeefy, Joel F. Liebman, and Stephen E. Stein
AC - William E. Acree, Jr., James S. Chickos
Quantity | Value | Units | Method | Reference | Comment |
---|---|---|---|---|---|
ΔsubH° | 95. ± 1. | kJ/mol | V | Pepekin, Lebedev, et al., 1975 | ALS |
Enthalpy of sublimation
ΔsubH (kJ/mol) | Temperature (K) | Method | Reference | Comment |
---|---|---|---|---|
95.5 | 333. | A | Stephenson and Malanowski, 1987 | Based on data from 323. to 343. K. See also Pepekin, Lebedev, et al., 1974.; AC |

References

Pepekin, Lebedev, et al., 1975
Pepekin, V.I.; Lebedev, V.P.; Balepin, A.A.; Lebedev, Yu.A.,
Thermochemistry of C-nitroso compounds,
Dokl. Phys. Chem. (Engl. Transl.), 1975, 221, 370-373, In original 1118. [all data]
Stephenson and Malanowski, 1987
Stephenson, Richard M.; Malanowski, Stanislaw,
Handbook of the Thermodynamics of Organic Compounds, 1987, https://doi.org/10.1007/978-94-009-3173-2
. [all data]
Pepekin, Lebedev, et al., 1974
Pepekin, V.I.; Lebedev, V.P.; Balepin, A.A.; Lebedev, Y.A.,
Dokl. Akad. Nauk SSSR, 1974, 221, 1118. [all data]