1-Pentene, 2,3,3-trimethyl-
- Formula: C8H16
- Molecular weight: 112.2126
- IUPAC Standard InChIKey: TUSBCMPNIOJUBX-UHFFFAOYSA-N
- CAS Registry Number: 560-23-6
- Chemical structure:

Phase change data

Data compiled as indicated in comments:
TRC - Thermodynamics Research Center, NIST Boulder Laboratories, Chris Muzny director
AC - William E. Acree, Jr., James S. Chickos
Quantity | Value | Units | Method | Reference | Comment |
---|---|---|---|---|---|
Tboil | 381.46 | K | N/A | Pomerantz, Mears, et al., 1949 | Uncertainty assigned by TRC = 0.25 K; TRC |
Tboil | 391.65 | K | N/A | Fenske, Braun, et al., 1947 | Uncertainty assigned by TRC = 0.3 K; TRC |
Tboil | 381.55 | K | N/A | Howard, Mears, et al., 1947 | Uncertainty assigned by TRC = 0.3 K; TRC |
Tboil | 381.4 | K | N/A | Whitmore and Laughlin, 1933 | Uncertainty assigned by TRC = 1. K; TRC |
Quantity | Value | Units | Method | Reference | Comment |
Tfus | 204. | K | N/A | Cline, 1939 | Uncertainty assigned by TRC = 3. K; TRC |
Quantity | Value | Units | Method | Reference | Comment |
ΔvapH° | 9.20 | kcal/mol | N/A | Reid, 1972 | AC |

Kovats' RI, non-polar column, isothermal

Column type | Active phase | Temperature (C) | I | Reference | Comment |
---|---|---|---|---|---|
Capillary | Petrocol DH | 30. | 743.3 | Soják, Addová, et al., 2004 | 150. m/0.25 mm/1. μm, H2 |
Capillary | Squalane | 30. | 730.3 | Soják, Addová, et al., 2004 | He; Column length: 93. m; Column diameter: 0.25 mm |
Capillary | Squalane | 50. | 735. | Chretien and Dubois, 1976 | |
Capillary | Squalane | 50. | 735. | Rijks and Cramers, 1974 | N2; Column length: 100. m; Column diameter: 0.25 mm |
Capillary | Squalane | 70. | 738. | Rijks and Cramers, 1974 | N2; Column length: 100. m; Column diameter: 0.25 mm |
Capillary | Squalane | 40. | 734. | Matukuma, 1969 | N2; Column length: 91.4 m; Column diameter: 0.25 mm |
Packed | Squalane | 30. | 730.5 | Tourres, 1967 | H2; Column length: 10. m |
Packed | Squalane | 50. | 734. | Tourres, 1967 | H2; Column length: 10. m |

Normal alkane RI, non-polar column, temperature ramp

Column type | Active phase | I | Reference | Comment |
---|---|---|---|---|
Capillary | Petrocol DH | 743. | Sojak, Kubinec, et al., 2006 | 150. m/0.25 mm/1.0 μm, 1. K/min; Tstart: 40. C; Tend: 300. C |
Capillary | Petrocol DH | 743. | Sojak, Kubinec, et al., 2006 | 150. m/0.25 mm/1.0 μm, 1. K/min; Tstart: 40. C; Tend: 300. C |

References

Pomerantz, Mears, et al., 1949
Pomerantz, P.; Mears, T.W.; Howard, F.L.,
Separation and Identification of the Major C1 to C10 Components of Triptene Residue,
J. Res. Natl. Bur. Stand. (U. S.), 1949, 42, 617-32. [all data]
Fenske, Braun, et al., 1947
Fenske, M.R.; Braun, W.G.; Wiegand, R.V.; Quiggle, D.; McCormick, R.H.; Rank, D.H.,
Raman Spectra of Hydrocarbons,
Anal. Chem., 1947, 19, 700. [all data]
Howard, Mears, et al., 1947
Howard, F.L.; Mears, T.W.; Fookson, A.; Pomerantz, P.; Brooks, D.B.,
Preparation and physical properties of several aliphatic hydrocarbons and intermediates,
J. Res. Natl. Bur. Stand. (U. S.), 1947, 38, 365. [all data]
Whitmore and Laughlin, 1933
Whitmore, F.C.; Laughlin, K.C.,
The Dehydration of Tertiary Alcohols Containing A Neopentyl System. II Methylisopropyl-tert-buthylcarbinol, Methyldi-tert-butylcarbimol, and Methylethylneopentylcarbinol,
J. Am. Chem. Soc., 1933, 55, 3732. [all data]
Cline, 1939
Cline, E.T.,
The Synthesis of Type III and Type V Olefins from Dimethylbutadien- monohydrobromide, Ph.D. Dissertation, Ohio State Univ., Columbus, OH, 1939. [all data]
Reid, 1972
Reid, Robert C.,
Handbook on vapor pressure and heats of vaporization of hydrocarbons and related compounds, R. C. Wilhort and B. J. Zwolinski, Texas A Research Foundation. College Station, Texas(1971). 329 pages.$10.00,
AIChE J., 1972, 18, 6, 1278-1278, https://doi.org/10.1002/aic.690180637
. [all data]
Soják, Addová, et al., 2004
Soják, L.; Addová, G.; Kubinec, R.; Kraus, A.; Bohác, A.,
Capillary gas chromatography-mass spectrometry of all 93 acyclic octenes and their identification in fluid catalytic cracked gasoline,
J. Chromatogr. A, 2004, 1025, 2, 237-253, https://doi.org/10.1016/j.chroma.2003.10.112
. [all data]
Chretien and Dubois, 1976
Chretien, J.R.; Dubois, J.-E.,
New Perspectives in the Prediction of Kovats Indices,
J. Chromatogr., 1976, 126, 171-189, https://doi.org/10.1016/S0021-9673(01)84071-1
. [all data]
Rijks and Cramers, 1974
Rijks, J.A.; Cramers, C.A.,
High precision capillary gas chromatography of hydrocarbons,
Chromatographia, 1974, 7, 3, 99-106, https://doi.org/10.1007/BF02269819
. [all data]
Matukuma, 1969
Matukuma, A.,
Retention indices of alkanes through C10 and alkenes through C8 and relation between boiling points and retention data,
Gas Chromatogr., Int. Symp. Anal. Instrum. Div Instrum Soc. Amer., 1969, 7, 55-75. [all data]
Tourres, 1967
Tourres, D.A.,
Structural analysis of industrial butene dimers by gas chromatography,
J. Gas Chromatogr., 1967, 5, 1, 35-40, https://doi.org/10.1093/chromsci/5.1.35
. [all data]
Sojak, Kubinec, et al., 2006
Sojak, L.; Kubinec, R.; Jurdakova, H.; Hajekova, E.; Bajus, M.,
GC-MS of polyethylene and polypropylene thermal cracking produxts,
Petroleum Coal, 2006, 48, 1, 1-14. [all data]