Glycine, N-(3-methyl-1-oxo-2-butenyl)-, methyl ester
- Formula: C8H13NO3
- Molecular weight: 171.1937
- IUPAC Standard InChIKey: HQJXTLHTVWAWPO-UHFFFAOYSA-N
- CAS Registry Number: 56009-34-8
- Chemical structure:
View 3d structure (requires JavaScript / HTML 5) - Other names: Methyl N-(β-methylcrotonyl)glycine; N-(β-Methylcrotonyl)glycine methyl ester; β-Methylcrotonylglycine, methyl ester; (3-Methyl-but-2-enoylamino)-acetic acid methyl ester

Van Den Dool and Kratz RI, non-polar column, temperature ramp

Column type | Active phase | I | Reference | Comment |
---|---|---|---|---|
Packed | OV-1 | 1377. | Ramsdell and Tanaka, 1977 | N2, Anakrom, 4. K/min; Column length: 2. m; Tstart: 80. C |

Normal alkane RI, non-polar column, temperature ramp

Column type | Active phase | I | Reference | Comment |
---|---|---|---|---|
Capillary | OV-101 | 1386. | Pinkston, Spiteller, et al., 1981 | H2, 80. C @ 7. min, 2. K/min; Column length: 30. m; Column diameter: 0.3 mm; Tend: 275. C |
Capillary | OV-101 | 1386. | Spiteller and Spiteller, 1979 | He, 75. C @ 7. min, 2. K/min; Column length: 25. m; Tend: 280. C |

References

Ramsdell and Tanaka, 1977
Ramsdell, H.S.; Tanaka, K.,
Gas chromatographic studies of twenty metabolically important acylglycines,
Clin. Chim. Acta, 1977, 74, 2, 109-114, https://doi.org/10.1016/0009-8981(77)90211-X
. [all data]
Pinkston, Spiteller, et al., 1981
Pinkston, D.; Spiteller, G.; von Henning, H.; Matthaei, D.,
High-resolution gas chromatography-mass spectrometry of the methyl esters of organic acids from uremic hemofiltrates,
J. Chromatogr., 1981, 223, 1, 1-19, https://doi.org/10.1016/S0378-4347(00)80063-8
. [all data]
Spiteller and Spiteller, 1979
Spiteller, M.; Spiteller, G.,
Trennung und charakterisierung saurer harnbest and- teile,
J. Chromatogr., 1979, 164, 3, 253-317, https://doi.org/10.1016/S0378-4347(00)81232-3
. [all data]