Benzenepropanoic acid, 4-hydroxy-, methyl ester
- Formula: C10H12O3
- Molecular weight: 180.2005
- IUPAC Standard InChIKey: XRAMJHXWXCMGJM-UHFFFAOYSA-N
- CAS Registry Number: 5597-50-2
- Chemical structure:
View 3d structure (requires JavaScript / HTML 5) - Other names: Hydrocinnamic acid, p-hydroxy-, methyl ester; Methyl p-hydroxyhydrocinnamate; Methyl 3-(p-hydroxyphenyl)propionate; Methyl 3-(4-hydroxyphenyl)propionate; Methyl 4-hydroxyhydrocinnamate; Methyl 3-(4-hydroxyphenyl)propanoate; 3-(4-Hydroxyphenyl)propionic acid, methyl ester; Propanoic acid, 3-(4-hydroxyphenyl), methyl ester

Phase change data

Data compiled by: Robert L. Brown and Stephen E. Stein
Reduced pressure boiling point
Tboil (K) | Pressure (bar) | Reference |
---|---|---|
381.2 | 0.015 | Aldrich Chemical Company Inc., 1990 |

Van Den Dool and Kratz RI, non-polar column, custom temperature program

Column type | Active phase | I | Reference | Comment |
---|---|---|---|---|
Capillary | VF-5MS | 1595.2 | Tret'yakov, 2008 | 30. m/0.25 mm/0.25 μm, He; Program: Multi-step temperature program; T(initial)=60C; T(final)=270C |

References

Aldrich Chemical Company Inc., 1990
Aldrich Chemical Company Inc.,
Catalog Handbook of Fine Chemicals, Aldrich Chemical Company, Inc., Milwaukee WI, 1990, 1. [all data]
Tret'yakov, 2008
Tret'yakov, K.V.,
Retention Data. NIST Mass Spectrometry Data Center., NIST Mass Spectrometry Data Center, 2008. [all data]