Cyclopentene, octafluoro-
- Formula: C5F8
- Molecular weight: 212.0407
- IUPAC Standard InChIKey: YBMDPYAEZDJWNY-UHFFFAOYSA-N
- CAS Registry Number: 559-40-0
- Chemical structure:

Reaction thermochemistry data

Data compiled by: John E. Bartmess
Individual Reactions
+
= C5ClF8-
By formula: Cl- + C5F8 = C5ClF8-
Quantity | Value | Units | Method | Reference | Comment |
---|---|---|---|---|---|
ΔrH° | 13.80 ± 0.20 | kcal/mol | TDAs | Hiraoka, Fujita, et al., 1905 | gas phase |
Quantity | Value | Units | Method | Reference | Comment |
ΔrG° | 8.14 ± 0.20 | kcal/mol | TDAs | Hiraoka, Fujita, et al., 1905 | gas phase |
+
= C5F8I-
By formula: I- + C5F8 = C5F8I-
Quantity | Value | Units | Method | Reference | Comment |
---|---|---|---|---|---|
ΔrH° | 10.00 ± 0.20 | kcal/mol | TDAs | Hiraoka, Fujita, et al., 1905 | gas phase |
Quantity | Value | Units | Method | Reference | Comment |
ΔrG° | 4.04 ± 0.20 | kcal/mol | TDAs | Hiraoka, Fujita, et al., 1905 | gas phase |
+
= C5BrF8-
By formula: Br- + C5F8 = C5BrF8-
Quantity | Value | Units | Method | Reference | Comment |
---|---|---|---|---|---|
ΔrH° | 12.70 ± 0.30 | kcal/mol | TDAs | Hiraoka, Fujita, et al., 1905 | gas phase |
Quantity | Value | Units | Method | Reference | Comment |
ΔrG° | 7.04 ± 0.30 | kcal/mol | TDAs | Hiraoka, Fujita, et al., 1905 | gas phase |
By formula: C5ClF8- + 2C5F8 = C10ClF16-
Quantity | Value | Units | Method | Reference | Comment |
---|---|---|---|---|---|
ΔrH° | 11.00 ± 0.20 | kcal/mol | TDAs | Hiraoka, Fujita, et al., 1905 | gas phase |
Quantity | Value | Units | Method | Reference | Comment |
ΔrG° | 2.35 ± 0.20 | kcal/mol | TDAs | Hiraoka, Fujita, et al., 1905 | gas phase |
By formula: C5F9- + 2C5F8 = C10F17-
Quantity | Value | Units | Method | Reference | Comment |
---|---|---|---|---|---|
ΔrH° | 6.70 ± 0.30 | kcal/mol | TDAs | Hiraoka, Fujita, et al., 1905 | gas phase |
Quantity | Value | Units | Method | Reference | Comment |
ΔrG° | 1.04 ± 0.30 | kcal/mol | TDAs | Hiraoka, Fujita, et al., 1905 | gas phase |
+
= C5F9-
Quantity | Value | Units | Method | Reference | Comment |
---|---|---|---|---|---|
ΔrH° | >30.00 | kcal/mol | TDAs | Hiraoka, Fujita, et al., 1905 | gas phase |

Ion clustering data

Data compiled by: John E. Bartmess
Clustering reactions
+
= C5BrF8-
By formula: Br- + C5F8 = C5BrF8-
Quantity | Value | Units | Method | Reference | Comment |
---|---|---|---|---|---|
ΔrH° | 12.70 ± 0.30 | kcal/mol | TDAs | Hiraoka, Fujita, et al., 1905 | gas phase |
Quantity | Value | Units | Method | Reference | Comment |
ΔrG° | 7.04 ± 0.30 | kcal/mol | TDAs | Hiraoka, Fujita, et al., 1905 | gas phase |
By formula: C5ClF8- + 2C5F8 = C10ClF16-
Quantity | Value | Units | Method | Reference | Comment |
---|---|---|---|---|---|
ΔrH° | 11.00 ± 0.20 | kcal/mol | TDAs | Hiraoka, Fujita, et al., 1905 | gas phase |
Quantity | Value | Units | Method | Reference | Comment |
ΔrG° | 2.35 ± 0.20 | kcal/mol | TDAs | Hiraoka, Fujita, et al., 1905 | gas phase |
By formula: C5F9- + 2C5F8 = C10F17-
Quantity | Value | Units | Method | Reference | Comment |
---|---|---|---|---|---|
ΔrH° | 6.70 ± 0.30 | kcal/mol | TDAs | Hiraoka, Fujita, et al., 1905 | gas phase |
Quantity | Value | Units | Method | Reference | Comment |
ΔrG° | 1.04 ± 0.30 | kcal/mol | TDAs | Hiraoka, Fujita, et al., 1905 | gas phase |
+
= C5ClF8-
By formula: Cl- + C5F8 = C5ClF8-
Quantity | Value | Units | Method | Reference | Comment |
---|---|---|---|---|---|
ΔrH° | 13.80 ± 0.20 | kcal/mol | TDAs | Hiraoka, Fujita, et al., 1905 | gas phase |
Quantity | Value | Units | Method | Reference | Comment |
ΔrG° | 8.14 ± 0.20 | kcal/mol | TDAs | Hiraoka, Fujita, et al., 1905 | gas phase |
+
= C5F9-
Quantity | Value | Units | Method | Reference | Comment |
---|---|---|---|---|---|
ΔrH° | >30.00 | kcal/mol | TDAs | Hiraoka, Fujita, et al., 1905 | gas phase |
+
= C5F8I-
By formula: I- + C5F8 = C5F8I-
Quantity | Value | Units | Method | Reference | Comment |
---|---|---|---|---|---|
ΔrH° | 10.00 ± 0.20 | kcal/mol | TDAs | Hiraoka, Fujita, et al., 1905 | gas phase |
Quantity | Value | Units | Method | Reference | Comment |
ΔrG° | 4.04 ± 0.20 | kcal/mol | TDAs | Hiraoka, Fujita, et al., 1905 | gas phase |

Phase change data

Data compiled as indicated in comments:
BS - Robert L. Brown and Stephen E. Stein
TRC - Thermodynamics Research Center, NIST Boulder Laboratories, Chris Muzny director

Quantity Value Units Method Reference Comment
Tboil300.KN/APCR Inc., 1990BS
Tboil300.KN/AHenne, 1962Uncertainty assigned by TRC = 4. K; TRC
Tboil298.4KN/AHenne and Latif, 1954Uncertainty assigned by TRC = 0.8 K; Apparently calculated from equation fit to vapor pressure data; TRC
Tboil307.KN/APark, Benning, et al., 1947Uncertainty assigned by TRC = 4. K; TRC

In addition to the Thermodynamics Research Center (TRC) data available from this site, much more physical and chemical property data is available from the following TRC products:

References

Hiraoka, Fujita, et al., 1905
Hiraoka, K.; Fujita, K.; Ishida, M.; Ichikawa, T.; Okada, H.; Hiizumi, K.; Wada, A.; Takao, K.; Yamabe, S.; Tsuchida, N.,
Gas-phase Ion/Molecule Reactions in C5F8,
J. Phys. Chem. A (2005), 1905, 109, 6, 1049-1056., https://doi.org/10.1021/jp040251k
. [all data]