2,2-Dimethoxypentane
- Formula: C7H16O2
- Molecular weight: 132.2007
- IUPAC Standard InChIKey: IRAHAFAANXPSRY-UHFFFAOYSA-N
- CAS Registry Number: 55904-98-8
- Chemical structure:
View 3d structure (requires JavaScript / HTML 5) - Permanent link for this species. Use this link for bookmarking this species for future reference.

Reaction thermochemistry data

Data compiled by: Hussein Y. Afeefy, Joel F. Liebman, and Stephen E. Stein
Individual Reactions
By formula: C7H16O2 + H2O = C5H10O + 2CH4O
Quantity | Value | Units | Method | Reference | Comment |
---|---|---|---|---|---|
ΔrH° | 19.52 ± 0.059 | kJ/mol | Cm | Wiberg and Squires, 1979 | liquid phase; Heat of hydrolysis |

References

Wiberg and Squires, 1979
Wiberg, K.B.; Squires, R.R.,
Thermodynamics of hydrolysis aliphatic ketals. An entropy component of steric effects,
J. Am. Chem. Soc., 1979, 101, 5512-5515. [all data]