1,2-Propanediol, 2-methyl-
- Formula: C4H10O2
- Molecular weight: 90.1210
- IUPAC Standard InChIKey: BTVWZWFKMIUSGS-UHFFFAOYSA-N
- CAS Registry Number: 558-43-0
- Chemical structure:
View 3d structure (requires JavaScript / HTML 5) - Other names: 2-Methyl-1,2-propanediol; 2-methylpropane-1,2-diol

Condensed phase thermochemistry data

Data compiled by: Hussein Y. Afeefy, Joel F. Liebman, and Stephen E. Stein
Quantity | Value | Units | Method | Reference | Comment |
---|---|---|---|---|---|
ΔfH°liquid | -540. | kJ/mol | Ccb | Moureu and Dode, 1937 | |
Quantity | Value | Units | Method | Reference | Comment |
ΔcH°liquid | -2464. | kJ/mol | Ccb | Moureu and Dode, 1937 | Corresponding ΔfHºliquid = -539.7 kJ/mol (simple calculation by NIST; no Washburn corrections) |

Phase change data

Data compiled by: Thermodynamics Research Center, NIST Boulder Laboratories, Chris Muzny director
Quantity | Value | Units | Method | Reference | Comment |
---|---|---|---|---|---|
Tboil | 451.15 | K | N/A | Henry, 1907 | Uncertainty assigned by TRC = 2. K |
Tboil | 450.65 | K | N/A | Henry, 1906 | Uncertainty assigned by TRC = 2. K |
Tboil | 450.15 | K | N/A | Wagner, 1888 | Uncertainty assigned by TRC = 3. K |

Reaction thermochemistry data

Data compiled by: Hussein Y. Afeefy, Joel F. Liebman, and Stephen E. Stein
Individual Reactions
By formula: C4H10O2 + C3H6O = C7H14O2 + H2O
Quantity | Value | Units | Method | Reference | Comment |
---|---|---|---|---|---|
ΔrH° | -3. | kJ/mol | Eqk | Anteunis and Rommelaere, 1970 | liquid phase |

Kovats' RI, non-polar column, isothermal

Column type | Active phase | Temperature (C) | I | Reference | Comment |
---|---|---|---|---|---|
Packed | Apiezon L | 160. | 718. | Bogoslovsky, Anvaer, et al., 1978 | Celite 545 |

Normal alkane RI, non-polar column, temperature ramp

Column type | Active phase | I | Reference | Comment |
---|---|---|---|---|
Capillary | OV-101 | 816. | Zenkevich, 2005 | 25. m/0.20 mm/0.10 μm, N2/He, 6. K/min; Tstart: 50. C; Tend: 250. C |

References

Moureu and Dode, 1937
Moureu, H.; Dode, M.,
Chaleurs de formation de l'oxyde d'ethylene, de l'ethanediol et de quelques homologues,
Bull. Soc. Chim. France, 1937, 4, 637-647. [all data]
Henry, 1907
Henry, L.,
C. R. Hebd. Seances Acad. Sci., 1907, 145, 21. [all data]
Henry, 1906
Henry, L.,
C. R. Hebd. Seances Acad. Sci., 1906, 144, 1404. [all data]
Wagner, 1888
Wagner, G.,
Chem. Ber., 1888, 21, 1230. [all data]
Anteunis and Rommelaere, 1970
Anteunis, M.; Rommelaere, Y.,
NMR experiments on acetals. XXIX. The ease of acetonide formation of some glycols,
Bull. Soc. Chim. Belg., 1970, 79, 523-530. [all data]
Bogoslovsky, Anvaer, et al., 1978
Bogoslovsky, Yu.N.; Anvaer, B.I.; Vigdergauz, M.S.,
Chromatographic constants in gas chromatography (in Russian), Standards Publ. House, Moscow, 1978, 192. [all data]
Zenkevich, 2005
Zenkevich, I.G.,
Experimentally measured retention indices., 2005. [all data]