3-Heptanol, 3-methyl-
- Formula: C8H18O
- Molecular weight: 130.2279
- IUPAC Standard InChIKey: PQOSNJHBSNZITJ-UHFFFAOYSA-N
- CAS Registry Number: 5582-82-1
- Chemical structure:
View 3d structure (requires JavaScript / HTML 5) - Other names: 3-Methyl-3-heptanol; 2-Ethyl-2-hexanol

Phase change data

Data compiled as indicated in comments:
TRC - Thermodynamics Research Center, NIST Boulder Laboratories, Chris Muzny director
AC - William E. Acree, Jr., James S. Chickos
Quantity | Value | Units | Method | Reference | Comment |
---|---|---|---|---|---|
Tboil | 443. | K | N/A | Colonge, Descotes, et al., 1965 | Uncertainty assigned by TRC = 4. K; TRC |
Tboil | 432.55 | K | N/A | Dorough, Glass, et al., 1941 | Uncertainty assigned by TRC = 0.7 K; TRC |
Tboil | 436.05 | K | N/A | Wibaut, Hoog, et al., 1939 | Uncertainty assigned by TRC = 0.5 K; TRC |
Tboil | 436.65 | K | N/A | Van Risseghem, 1930 | Uncertainty assigned by TRC = 3. K; TRC |
Enthalpy of vaporization
ΔvapH (kJ/mol) | Temperature (K) | Method | Reference | Comment |
---|---|---|---|---|
54.1 | 359. | A | Stephenson and Malanowski, 1987 | Based on data from 344. to 433. K.; AC |
54.7 | 353. | N/A | Wilhoit and Zwolinski, 1973 | Based on data from 338. to 433. K.; AC |

Van Den Dool and Kratz RI, non-polar column, temperature ramp

Data compiled by: NIST Mass Spectrometry Data Center, William E. Wallace, director

Column type Capillary
Active phase HP-5
Column length (m) 30.
Carrier gas He
Substrate
Column diameter (mm) 0.25
Phase thickness (μm) 0.25
Tstart (C) 50.
Tend (C) 260.
Heat rate (K/min) 10.
Initial hold (min) 3.
Final hold (min)
I 1010.
ReferenceZhao, Wang X.Y., et al., 2006
Comment MSDC-RI

References

Colonge, Descotes, et al., 1965
Colonge, J.; Descotes, G.; Bahurel, Y.,
Primary α-Methyl-α-ethylenic Alcohols,
Bull. Soc. Chim. Fr., 1965, 1965, 619-25. [all data]
Dorough, Glass, et al., 1941
Dorough, G.L.; Glass, H.B.; Gresham, T.L.; Malone, G.B.; Reid, E.E.,
Structure-property relationships in some isomeric octanols,
J. Am. Chem. Soc., 1941, 63, 3100. [all data]
Wibaut, Hoog, et al., 1939
Wibaut, J.P.; Hoog, H.; Langedijk, S.L.; Overhoff, J.; Smittenberg, J.; Benninga, N.; Bouman, G.P.; van Dijk, H.; Gaade, W.; Geldof, H.; Hackmann, J.Th.; Jonker, E.W.; Paap, T.; Zuiderweg, F.J.,
Study on the Preparation and the Physical Constants of A Number of Alkanes and Cycloalkanes,
Recl. Trav. Chim. Pays-Bas, 1939, 58, 329. [all data]
Van Risseghem, 1930
Van Risseghem, H.,
Bull. Soc. Chim. Belg., 1930, 39, 369. [all data]
Stephenson and Malanowski, 1987
Stephenson, Richard M.; Malanowski, Stanislaw,
Handbook of the Thermodynamics of Organic Compounds, 1987, https://doi.org/10.1007/978-94-009-3173-2
. [all data]
Wilhoit and Zwolinski, 1973
Wilhoit, R.C.; Zwolinski, B.J.,
Physical and thermodynamic properties of aliphatic alcohols,
J. Phys. Chem. Ref. Data Suppl., 1973, 1, 2, 1. [all data]