Benzoic acid, o-mercapto-, acetate
- Formula: C9H8O3S
- Molecular weight: 196.223
- IUPAC Standard InChIKey: TZQYOCWVOLPJHD-UHFFFAOYSA-N
- CAS Registry Number: 55819-78-8
- Chemical structure:
View 3d structure (requires JavaScript / HTML 5) - Permanent link for this species. Use this link for bookmarking this species for future reference.

Reaction thermochemistry data

Data compiled by: Hussein Y. Afeefy, Joel F. Liebman, and Stephen E. Stein
Individual Reactions
By formula: C9H8O3S + H2O = C7H6O2S + C2H4O2
Quantity | Value | Units | Method | Reference | Comment |
---|---|---|---|---|---|
ΔrH° | -24.5 ± 0.3 | kJ/mol | Cm | Nelander, 1964 | solid phase; Heat of hydrolysis |

References

Nelander, 1964
Nelander, L.,
The heats of hydrolysis of aspirin, thioaspirin, and their p-analogues,
Acta Chem. Scand., 1964, 18, 973-984. [all data]