cyclopentanone, 3-(1,1-dimethylethyl)-
- Formula: C9H16O
- Molecular weight: 140.2227
- IUPAC Standard InChIKey: YNZLLBXTQLRISL-UHFFFAOYSA-N
- CAS Registry Number: 5581-94-2
- Chemical structure:
View 3d structure (requires JavaScript / HTML 5) - Permanent link for this species. Use this link for bookmarking this species for future reference.

Phase change data

Data compiled by: Thermodynamics Research Center, NIST Boulder Laboratories, Chris Muzny director
Quantity | Value | Units | Method | Reference | Comment |
---|---|---|---|---|---|
Tboil | 482.85 | K | N/A | Boord, Perilstein, et al., 1944 | Uncertainty assigned by TRC = 0.4 K |
Quantity | Value | Units | Method | Reference | Comment |
Tfus | 262.98 | K | N/A | Boord, Perilstein, et al., 1944 | Uncertainty assigned by TRC = 0.3 K |

References

Boord, Perilstein, et al., 1944
Boord, C.E.; Perilstein, W.L.; Greenlee, K.W.,
, Am. Pet. Inst. Hydrocarbon Res. Proj., Sixth Annu. Ref., Ohio State Univ., Aug. 31, 1944. [all data]