1-Propene, 2-chloro-
- Formula: C3H5Cl
- Molecular weight: 76.525
- IUPAC Standard InChIKey: PNLQPWWBHXMFCA-UHFFFAOYSA-N
- CAS Registry Number: 557-98-2
- Chemical structure:

Phase change data

Data compiled as indicated in comments:
BS - Robert L. Brown and Stephen E. Stein
TRC - Thermodynamics Research Center, NIST Boulder Laboratories, Chris Muzny director
AC - William E. Acree, Jr., James S. Chickos
Quantity | Value | Units | Method | Reference | Comment |
---|---|---|---|---|---|
Tboil | 295.7 ± 0.5 | K | AVG | N/A | Average of 6 values; Individual data points |
Quantity | Value | Units | Method | Reference | Comment |
Tfus | 135.8 | K | N/A | Timmermans, 1927 | Uncertainty assigned by TRC = 0.4 K; TRC |
Enthalpy of vaporization
ΔvapH (kJ/mol) | Temperature (K) | Method | Reference | Comment |
---|---|---|---|---|
28.0 | 244. | A | Stephenson and Malanowski, 1987 | Based on data from 229. to 327. K. See also Dykyj, 1970.; AC |

Gas phase thermochemistry data

Data compiled by: Hussein Y. Afeefy, Joel F. Liebman, and Stephen E. Stein
Quantity | Value | Units | Method | Reference | Comment |
---|---|---|---|---|---|
ΔfH°gas | -5.90 | kcal/mol | Eqk | Shevtsova, Rozhnov, et al., 1970 |

Reaction thermochemistry data

Data compiled by: Hussein Y. Afeefy, Joel F. Liebman, and Stephen E. Stein
Individual Reactions
By formula: C3H6Cl2 = C3H5Cl + HCl
Quantity | Value | Units | Method | Reference | Comment |
---|---|---|---|---|---|
ΔrH° | 15.6 | kcal/mol | Eqk | Levanova, Rodova, et al., 1983 | liquid phase; Flow reactor |
ΔrH° | 14.3 ± 0.2 | kcal/mol | Eqk | Shevtsova, Rozhnov, et al., 1970 | gas phase; Heat of Dehydrochlorination at 392 K |
By formula: C3H6BrCl = HBr + C3H5Cl
Quantity | Value | Units | Method | Reference | Comment |
---|---|---|---|---|---|
ΔrH° | 15.8 | kcal/mol | Eqk | Levanova, Rodova, et al., 1983 | liquid phase; Flow reactor |
By formula: C3H6Cl2 = C3H5Cl + HCl
Quantity | Value | Units | Method | Reference | Comment |
---|---|---|---|---|---|
ΔrH° | 12.7 | kcal/mol | Eqk | Levanova, Rodova, et al., 1983 | gas phase; Flow reactor |
By formula: C3H5Cl + HCl = C3H6Cl2
Quantity | Value | Units | Method | Reference | Comment |
---|---|---|---|---|---|
ΔrH° | 14.3 ± 0.2 | kcal/mol | Eqk | Shevtsova, Rozhnov, et al., 1970 | gas phase |

Normal alkane RI, non-polar column, temperature ramp

View large format table.

Column type Active phase I Reference Comment
CapillaryOV-101470.Zenkevich, 200525. m/0.20 mm/0.10 μm, N2/He, 6. K/min; Tstart: 50. C; Tend: 250. C

Normal alkane RI, non-polar column, custom temperature program

View large format table.

Column type Active phase I Reference Comment
CapillaryPolydimethyl siloxanes470.Zenkevich and Chupalov, 1996Program: not specified

References

Timmermans, 1927
Timmermans, J.,
The Melting Point of Organic Substances,
Bull. Soc. Chim. Belg., 1927, 36, 502. [all data]
Stephenson and Malanowski, 1987
Stephenson, Richard M.; Malanowski, Stanislaw,
Handbook of the Thermodynamics of Organic Compounds, 1987, https://doi.org/10.1007/978-94-009-3173-2
. [all data]
Dykyj, 1970
Dykyj, J.,
Petrochemica, 1970, 10, 2, 51. [all data]