1-Propene, 3,3'-oxybis-
- Formula: C6H10O
- Molecular weight: 98.1430
- IUPAC Standard InChIKey: ATVJXMYDOSMEPO-UHFFFAOYSA-N
- CAS Registry Number: 557-40-4
- Chemical structure:
View 3d structure (requires JavaScript / HTML 5) - Other names: Allyl ether; Diallyl ether; 3,3'-Oxybis(1-propene); (CH2=CHCH2)2O; Ether, diallyl; UN 2360

Phase change data

Data compiled as indicated in comments:
BS - Robert L. Brown and Stephen E. Stein
TRC - Thermodynamics Research Center, NIST Boulder Laboratories, Chris Muzny director
Quantity | Value | Units | Method | Reference | Comment |
---|---|---|---|---|---|
Tboil | 367.2 | K | N/A | Weast and Grasselli, 1989 | BS |
Tboil | 367. | K | N/A | American Tokyo Kasei, 1988 | BS |
Tboil | 367.7 | K | N/A | Wright, 1961 | Uncertainty assigned by TRC = 0.5 K; TRC |
Tboil | 367.7 | K | N/A | Wright, 1960 | Uncertainty assigned by TRC = 0.3 K; TRC |

Gas phase ion energetics data

Data evaluated by: Edward P. Hunter and Sharon G. Lias
Quantity | Value | Units | Method | Reference | Comment |
---|---|---|---|---|---|
Proton affinity (review) | 827.4 | kJ/mol | N/A | Hunter and Lias, 1998 | |
Quantity | Value | Units | Method | Reference | Comment |
Gas basicity | 800.0 | kJ/mol | N/A | Hunter and Lias, 1998 |

Normal alkane RI, non-polar column, temperature ramp

View large format table.

Column type Active phase I Reference Comment
CapillaryOV-101678.Zenkevich and Kulikova, 1993He, 3. K/min; Column length: 54. m; Column diameter: 0.26 mm; Tstart: 50. C; Tend: 230. C

References

Weast and Grasselli, 1989
CRC Handbook of Data on Organic Compounds, 2nd Editon, Weast,R.C and Grasselli, J.G., ed(s)., CRC Press, Inc., Boca Raton, FL, 1989, 1. [all data]
American Tokyo Kasei, 1988
American Tokyo Kasei,
TCI American Organic Chemical 88/89 Catalog, American Tokyo Kasei, Portland, OR, 1988, 1610. [all data]
Wright, 1961
Wright, F.J.,
Influence of temperature on viscosity of nonassociated liquids,
J. Chem. Eng. Data, 1961, 6, 454. [all data]
Wright, 1960
Wright, F.J.,
Latent Heat of Vaporization and Composition,
Recl. Trav. Chim. Pays-Bas, 1960, 79, 784-9. [all data]
Hunter and Lias, 1998
Hunter, E.P.; Lias, S.G.,
Evaluated Gas Phase Basicities and Proton Affinities of Molecules: An Update,
J. Phys. Chem. Ref. Data, 1998, 27, 3, 413-656, https://doi.org/10.1063/1.556018
. [all data]