N,3-dinitroaniline
- Formula: C6H5N3O4
- Molecular weight: 183.1216
- IUPAC Standard InChIKey: WHXKPQGUZPSKPN-UHFFFAOYSA-N
- CAS Registry Number: 55739-01-0
- Chemical structure:
View 3d structure (requires JavaScript / HTML 5) - Permanent link for this species. Use this link for bookmarking this species for future reference.

Phase change data

Data compiled by: Thermodynamics Research Center, NIST Boulder Laboratories, Chris Muzny director
Quantity | Value | Units | Method | Reference | Comment |
---|---|---|---|---|---|
Tfus | 365.65 | K | N/A | Bruhl, 1897 | Uncertainty assigned by TRC = 2. K |

References

Bruhl, 1897
Bruhl, J.W.,
Spectrochemistry of nitrogen containing compounds V,
Z. Phys. Chem., Stoechiom. Verwandtschaftsl., 1897, 22, 373. [all data]