Ethanedial, dioxime
- Formula: C2H4N2O2
- Molecular weight: 88.0654
- IUPAC Standard InChIKey: LJHFIVQEAFAURQ-UHFFFAOYSA-N
- CAS Registry Number: 557-30-2
- Chemical structure:
View 3d structure (requires JavaScript / HTML 5) - Other names: Glyoxal, dioxime; Ethanedione dioxime; Glyoxime; Pik-off; Cga-22911

Condensed phase thermochemistry data

Data compiled by: Hussein Y. Afeefy, Joel F. Liebman, and Stephen E. Stein
Quantity | Value | Units | Method | Reference | Comment |
---|---|---|---|---|---|
ΔcH°solid | -304.0 | kcal/mol | Ccb | Milone and Venturello, 1936 | At 292 K,Atti Accad. Sci. Torino. Fis, Mat. Nat. 1936,71,395 |

References

Milone and Venturello, 1936
Milone, M.; Venturello, G.,
Ricerche sulle diossime - CXVII,
Gazz. Chim. Ital., 1936, 66, 808-812. [all data]