Silane, dipropyloxy-, dibutyloxy-
- Formula: C14H32O4Si
- Molecular weight: 292.4870
- IUPAC Standard InChIKey: TYGILNMMQISXHH-UHFFFAOYSA-N
- CAS Registry Number: 55683-16-4
- Chemical structure:

Kovats' RI, non-polar column, isothermal

Column type | Active phase | Temperature (C) | I | Reference | Comment |
---|---|---|---|---|---|
Packed | Apiezon L | 160. | 1328. | Ellrén, Peetre, et al., 1974 | N2, Chromosorb G |
Capillary | Apiezon L | 160. | 1323. | Peetre, 1974 | Column length: 50. m; Column diameter: 0.25 mm |

References

Ellrén, Peetre, et al., 1974
Ellrén, O.; Peetre, I.-B.; Smith, B.E.F.,
Gas chromatographic investigation of organometallic compounds and their carbon analogues. I. Determination, calculation and correlation of Kováts retention indices for tetraalkoxysilanes,
J. Chromatogr., 1974, 88, 2, 295-310, https://doi.org/10.1016/S0021-9673(00)83154-4
. [all data]
Peetre, 1974
Peetre, I.-B.,
Gas chromatographic investigation of organometallic compounds and their carbon analogues. II. Improved method for calculating retention indices of tetraalkoxysilanes,
J. Chromatogr., 1974, 88, 2, 311-321, https://doi.org/10.1016/S0021-9673(00)83155-6
. [all data]