Benzene, 1,4-dimethyl-2-(2-methylpropyl)-
- Formula: C12H18
- Molecular weight: 162.2713
- IUPAC Standard InChIKey: IWEUJYZCURHZFV-UHFFFAOYSA-N
- CAS Registry Number: 55669-88-0
- Chemical structure:
View 3d structure (requires JavaScript / HTML 5) - Other names: 1-Isobutyl-2,5-dimethylbenzene; 1,4-Dimethyl-2-isobutylbenzene

Kovats' RI, polar column, isothermal

Column type | Active phase | Temperature (C) | I | Reference | Comment |
---|---|---|---|---|---|
Capillary | Carbowax 20M | 90. | 1402.1 | Döring, Estel, et al., 1974 | Column length: 100. m; Column diameter: 0.2 mm |

References

Döring, Estel, et al., 1974
Döring, C.E.; Estel, D.; Fischer, R.,
Kapillar-gaschromatographische Charakterisierung von C10-bis C12-Aromaten,
J. Prakt. Chem., 1974, 316, 1, 1-12, https://doi.org/10.1002/prac.19743160102
. [all data]