(E)-(±)-2-methyl-5-(1-methylvinyl)cyclohex-2-en-1-one oxime

Condensed phase thermochemistry data

Data compiled by: Eugene S. Domalski and Elizabeth D. Hearing

Constant pressure heat capacity of solid

Cp,solid (J/mol*K) Temperature (K) Reference Comment
255.2298.15Meijer, Blok, et al., 1977T = 160 to 385 K.

References

Meijer, Blok, et al., 1977
Meijer, E.L.; Blok, J.G.; Kroon, J.; Oonk, H.A.J., The carvoxime system. IV. Heat capacities and enthalpies of melting of DL-carvoxime, L-carvoxime and standard n-heptane, Thermochim. Acta, 1977, 20, 325-334. [all data]