N-Glycylglycine
- Formula: C4H8N2O3
- Molecular weight: 132.1179
- IUPAC Standard InChIKey: YMAWOPBAYDPSLA-UHFFFAOYSA-N
- CAS Registry Number: 556-50-3
- Chemical structure:

Reaction thermochemistry data

Data compiled as indicated in comments:
RCD - Robert C. Dunbar
B - John E. Bartmess
Individual Reactions
By formula: Na+ + C4H8N2O3 = (Na+ • C4H8N2O3)
Quantity | Value | Units | Method | Reference | Comment |
---|---|---|---|---|---|
ΔrH° | 42.3 ± 1.7 | kcal/mol | CIDC | Cerda, Hoyau, et al., 1998 | See amide; RCD |
ΔrH° | 42.9 | kcal/mol | CIDT | Klassen, Anderson, et al., 1996 | RCD |
Free energy of reaction
ΔrG° (kcal/mol) | T (K) | Method | Reference | Comment |
---|---|---|---|---|
34.2 | 0. | CIDC | Feng, Gronert, et al., 1999 | RCD |
CAS Reg. No. 23372-53-4 + = C8H15N4O6-
By formula: CAS Reg. No. 23372-53-4 + C4H8N2O3 = C8H15N4O6-
Quantity | Value | Units | Method | Reference | Comment |
---|---|---|---|---|---|
ΔrH° | 7.50 ± 0.30 | kcal/mol | TDEq | Liu, Wyttenbacj, et al., 2004 | gas phase; B |
Quantity | Value | Units | Method | Reference | Comment |
ΔrG° | 3.12 | kcal/mol | TDEq | Liu, Wyttenbacj, et al., 2004 | gas phase; B |

Gas phase ion energetics data

Data evaluated by: Edward P. Hunter and Sharon G. Lias
Quantity | Value | Units | Method | Reference | Comment |
---|---|---|---|---|---|
Gas basicity | 211. | kcal/mol | N/A | Hunter and Lias, 1998 |

Ion clustering data

Data compiled by: Robert C. Dunbar
Clustering reactions
By formula: Na+ + C4H8N2O3 = (Na+ • C4H8N2O3)
Quantity | Value | Units | Method | Reference | Comment |
---|---|---|---|---|---|
ΔrH° | 42.3 ± 1.7 | kcal/mol | CIDC | Cerda, Hoyau, et al., 1998 | See amide |
ΔrH° | 42.9 | kcal/mol | CIDT | Klassen, Anderson, et al., 1996 |
Free energy of reaction
ΔrG° (kcal/mol) | T (K) | Method | Reference |
---|---|---|---|
34.2 | 0. | CIDC | Feng, Gronert, et al., 1999 |

Condensed phase thermochemistry data

Data compiled as indicated in comments:
ALS - Hussein Y. Afeefy, Joel F. Liebman, and Stephen E. Stein
DH - Eugene S. Domalski and Elizabeth D. Hearing

Quantity Value Units Method Reference Comment
Δfsolid-178.70 ± 0.31kcal/molCcbDiaz, Domalski, et al., 1992ALS
Δfsolid-178.70 ± 0.15kcal/molCcbHuffman, 1942Heat of combustion corrected for pressure; ALS
Quantity Value Units Method Reference Comment
Δcsolid-470.76 ± 0.30kcal/molCcbDiaz, Domalski, et al., 1992ALS
Δcsolid-470.76 ± 0.13kcal/molCcbHuffman, 1942Heat of combustion corrected for pressure; ALS
Δcsolid-472.7kcal/molCcbFischer and Wrede, 1904Heat of combustion corrected for pressure; ALS
Δcsolid-471.80kcal/molCcbLemoult, 1904ALS
Quantity Value Units Method Reference Comment
solid,1 bar43.09cal/mol*KN/AHutchens, Cole, et al., 1969DH
solid,1 bar45.41cal/mol*KN/AHuffman, 1941Extrapolation below 90 K, 56.90 J/mol*K.; DH

Constant pressure heat capacity of solid

Cp,solid (cal/mol*K) Temperature (K) Reference Comment
35.6298.Badelin, Kulikov, et al., 1990T = 298, 313, 333, 348 K.; DH
35.61298.Kulikov, Kozlov, et al., 1989T = 298 to 348 K.; DH
39.190298.15Hutchens, Cole, et al., 1969T = 11 to 305 K.; DH
38.671293.9Huffman, 1941T = 87 to 294 K. Value is unsmoothed experimental datum.; DH

References

Cerda, Hoyau, et al., 1998
Cerda, B.A.; Hoyau, S.; Ohanessian, G.; Wesdemiotis, C.,
PAs of Peptides,
J. Am. Chem. Soc., 1998, 120, 2437. [all data]
Klassen, Anderson, et al., 1996
Klassen, J.S.; Anderson, S.G.; Blades, A.T.; Kebarle, P.,
Reaction Enthalpies for M+L = M+ + L, Where M+ = Na+ and K+ and L = Acetamide, N-Methylacetamide, N,N-Dimethylacetamide, Glycine, and Glycylglycine, from Determinations of the Collision-Induced Dissociation Thresholds,
J. Phys. Chem., 1996, 100, 33, 14218, https://doi.org/10.1021/jp9608382
. [all data]
Feng, Gronert, et al., 1999
Feng, W.Y.; Gronert, S.; Lebrilla, C.B.,
Lithium and sodium ion binding energies of N-acetyl and N-glycyl amino acids,
J. Am. Chem. Soc., 1999, 121, 6, 1365, https://doi.org/10.1021/ja983116s
. [all data]
Liu, Wyttenbacj, et al., 2004
Liu, D.; Wyttenbacj, T.; Carpenter, C.J.; Bowers, M.T.,
Investigation of Non-Covalent Interactions in Deprotonated Peptides: Structural and Energetic Competition between Aggregation and Hydration,
J. Am. Chem. Soc., 2004, 126, 10, 3261, https://doi.org/10.1021/ja0393628
. [all data]
Hunter and Lias, 1998
Hunter, E.P.; Lias, S.G.,
Evaluated Gas Phase Basicities and Proton Affinities of Molecules: An Update,
J. Phys. Chem. Ref. Data, 1998, 27, 3, 413-656, https://doi.org/10.1063/1.556018
. [all data]