Nitroglycerin
- Formula: C3H5N3O9
- Molecular weight: 227.0865
- IUPAC Standard InChIKey: SNIOPGDIGTZGOP-UHFFFAOYSA-N
- CAS Registry Number: 55-63-0
- Chemical structure:

Gas phase thermochemistry data

Data compiled by: Hussein Y. Afeefy, Joel F. Liebman, and Stephen E. Stein
Quantity | Value | Units | Method | Reference | Comment |
---|---|---|---|---|---|
ΔfH°gas | -279.1 ± 2.7 | kJ/mol | Ccb | Miroshnichenko, Korchatova, et al., 1988 | see Miroshnichenko, Korchatova, et al., 1985 |

Phase change data

Data compiled as indicated in comments:
ALS - Hussein Y. Afeefy, Joel F. Liebman, and Stephen E. Stein
AC - William E. Acree, Jr., James S. Chickos
Quantity | Value | Units | Method | Reference | Comment |
---|---|---|---|---|---|
ΔvapH° | 92.0 ± 2.1 | kJ/mol | C | Miroshnichenko, Korchatova, et al., 1988 | see Miroshnichenko, Korchatova, et al., 1985; ALS |
Enthalpy of vaporization
ΔvapH (kJ/mol) | Temperature (K) | Method | Reference | Comment |
---|---|---|---|---|
104.5 | 308. | A | Stephenson and Malanowski, 1987 | Based on data from 293. to 373. K.; AC |
58.6 | 415. | N/A | Stull, 1947 | Based on data from 400. to 524. K.; AC |
Antoine Equation Parameters
log10(P) = A − (B / (T + C))
P = vapor pressure (bar)
T = temperature (K)
View plot Requires a JavaScript / HTML 5 canvas capable browser.
Temperature (K) | A | B | C | Reference | Comment |
---|---|---|---|---|---|
400. to 524. | 4.07588 | 2508.448 | -39.235 | Stull, 1947 | Coefficents calculated by NIST from author's data. |
Enthalpy of fusion
ΔfusH (kJ/mol) | Temperature (K) | Reference | Comment |
---|---|---|---|
21.87 | 285.5 | Acree, 1991 | AC |

Reaction thermochemistry data

Data compiled by: Hussein Y. Afeefy, Joel F. Liebman, and Stephen E. Stein
Individual Reactions
By formula: C3H6N2O7 + HNO3 = C3H5N3O9 + H2O
Quantity | Value | Units | Method | Reference | Comment |
---|---|---|---|---|---|
ΔrH° | -6. ± 1. | kJ/mol | Eqk | Kazakov, Kirpichev, et al., 1990 | liquid phase; Heat of nitration |
ΔrH° | -5. ± 1. | kJ/mol | Cm | Kazakov, Lagodzinskaya, et al., 1989 | liquid phase |
By formula: C3H6N2O7 + HNO3 = C3H5N3O9 + H2O
Quantity | Value | Units | Method | Reference | Comment |
---|---|---|---|---|---|
ΔrH° | -10. ± 1. | kJ/mol | Eqk | Kazakov, Kirpichev, et al., 1990 | liquid phase; Heat of nitration |
By formula: C3H7NO5 + 2HNO3 = C3H5N3O9 + 2H2O
Quantity | Value | Units | Method | Reference | Comment |
---|---|---|---|---|---|
ΔrH° | -18. ± 1. | kJ/mol | Cm | Kazakov, Lagodzinskaya, et al., 1989 | liquid phase |
By formula: C3H8O3 + 3HNO3 = C3H5N3O9 + 3H2O
Quantity | Value | Units | Method | Reference | Comment |
---|---|---|---|---|---|
ΔrH° | -36. ± 2. | kJ/mol | Cm | Kazakov, Lagodzinskaya, et al., 1989 | liquid phase |

Kovats' RI, non-polar column, isothermal

Column type | Active phase | Temperature (C) | I | Reference | Comment |
---|---|---|---|---|---|
Capillary | DB-5 | 140. | 1364.54 | Hobbs and Conde, 1992 | 30. m/0.25 mm/0.25 μm |
Capillary | DB-5 | 140. | 1372.91 | Hobbs and Conde, 1992 | 30. m/0.25 mm/0.25 μm |

Kovats' RI, non-polar column, temperature ramp

Column type | Active phase | I | Reference | Comment |
---|---|---|---|---|
Packed | OV-101 | 1387. | Alley and Dykes, 1972 | 6. K/min; Tstart: 70. C; Tend: 220. C |

Kovats' RI, non-polar column, custom temperature program

Column type | Active phase | I | Reference | Comment |
---|---|---|---|---|
Capillary | Methyl Silicone | 1356. | Staples, 2005 | Column diameter: 0.25 mm; Program: not specified |

Van Den Dool and Kratz RI, non-polar column, temperature ramp

Column type | Active phase | I | Reference | Comment |
---|---|---|---|---|
Capillary | DB-5 | 1356.07 | Hobbs and Conde, 1992 | 30. m/0.25 mm/0.25 μm, 5. K/min; Tstart: 40. C; Tend: 300. C |
Capillary | DB-5 | 1366.09 | Hobbs and Conde, 1992 | 30. m/0.25 mm/0.25 μm, 5. K/min; Tstart: 40. C; Tend: 300. C |

Normal alkane RI, non-polar column, custom temperature program

Column type | Active phase | I | Reference | Comment |
---|---|---|---|---|
Capillary | DB-5 | 1356. | Staples, 2004 | He; Program: not specified |
Capillary | DB-5 | 1361. | Staples, 2004 | He; Program: not specified |

Condensed phase thermochemistry data

Data compiled by: Hussein Y. Afeefy, Joel F. Liebman, and Stephen E. Stein
Quantity | Value | Units | Method | Reference | Comment |
---|---|---|---|---|---|
ΔfH°liquid | -88.4 ± 0.5 | kcal/mol | Eqk | Kazakov, Kirpichev, et al., 1990 | Heat of nitration |
ΔfH°liquid | -88.70 ± 0.41 | kcal/mol | Ccb | Miroshnichenko, Korchatova, et al., 1988 | see Miroshnichenko, Korchatova, et al., 1985 |
ΔfH°liquid | -89.6 | kcal/mol | Ccb | Handrick, 1956 | Naval Powder Factory, 1951 |
ΔfH°liquid | -89.0 ± 0.9 | kcal/mol | Ccb | Taylor and Hall, 1947 | Heat of combustion corrected for pressure |
ΔfH°liquid | -84.58 | kcal/mol | Ccb | Rinkenbach, 1926 | Author's h288_condensed=-81.70 kcal/mol |
Quantity | Value | Units | Method | Reference | Comment |
ΔcH°liquid | -365. ± 3. | kcal/mol | AVG | N/A | Average of 7 values; Individual data points |

References

Miroshnichenko, Korchatova, et al., 1988
Miroshnichenko, E.A.; Korchatova, L.I.; Shelaputina, V.P.; Zyuz'kevich, S.A.; Lebedev, Yu.A.,
Thermochemistry of glyceryl trinitrate,
Bull. Acad. Sci. USSR, Div. Chem. Sci., 1988, 1778-1781. [all data]
Miroshnichenko, Korchatova, et al., 1985
Miroshnichenko, E.A.; Korchatova, L.I.; Shelaputina, V.P.; Zyuzkevich, S.A.; Lebedev, Yu.A.,
Thermochemistry of glyceryl trinitrate,
Bull. Acad. Sci. USSR, Div. Chem. Sci., 1985, 1778-1781. [all data]
Stephenson and Malanowski, 1987
Stephenson, Richard M.; Malanowski, Stanislaw,
Handbook of the Thermodynamics of Organic Compounds, 1987, https://doi.org/10.1007/978-94-009-3173-2
. [all data]
Stull, 1947
Stull, Daniel R.,
Vapor Pressure of Pure Substances. Organic and Inorganic Compounds,
Ind. Eng. Chem., 1947, 39, 4, 517-540, https://doi.org/10.1021/ie50448a022
. [all data]
Acree, 1991
Acree, William E.,
Thermodynamic properties of organic compounds: enthalpy of fusion and melting point temperature compilation,
Thermochimica Acta, 1991, 189, 1, 37-56, https://doi.org/10.1016/0040-6031(91)87098-H
. [all data]
Kazakov, Kirpichev, et al., 1990
Kazakov, A.I.; Kirpichev, E.P.; Lagodzinskaya, G.V.; Andrienko, L.P.; Yunda, N.G.; Korolev, A.M.; Rubstov, Yu.I.; Manelis, G.B.; Eremenko, L.T.,
Study of nitration equilibrium in the glycerin-aqueous nitric acid system. 2. Changes in ΔH and ΔS in the nitration reaction,
Bull. Acad. Sci. USSR, Div. Chem. Sci., 1990, 1565-1570. [all data]
Kazakov, Lagodzinskaya, et al., 1989
Kazakov, A.I.; Lagodzinskaya, E.P.; Kirpichev, E.P.; Andrienko, L.P.; Yunda, N.G.; Korolev, A.M.; Robtsov, Yu.I.; Manelis, G.V.; Eremenko, L.T.,
Thermodynamics of nitration of glycerol,
Dokl. Phys. Chem. (Engl. Transl.), 1989, 305, 287-291. [all data]
Hobbs and Conde, 1992
Hobbs, J.R.; Conde, E.P.,
Gas chromatographic retention indices of explosives and nitro-compounds
in Advances in Analysis and Detection of Explosives: Proceedings of the 4th International Symposium on Analysis of Detection of Explosives, September 7-10, 1992, Jerusalem Israel, J. Yinon, ed(s)., Kluwer Academic Publishers, Netherlands, 1992, 153-164. [all data]
Alley and Dykes, 1972
Alley, B.J.; Dykes, H.W.H.,
Gas-Liquid Chromatographic Determination of Nitrate Esters,Stabilizers and Plasticizers in Nitrocellulose-Base Propellants,
J. Chromatogr., 1972, 71, 1, 23-37, https://doi.org/10.1016/S0021-9673(01)85687-9
. [all data]
Staples, 2005
Staples, E.J.,
Ultrahigh-speed chromatography and virtual chemical sensors for detecting explosives and chemical warfare agents,
IEEE Sens. J., 2005, 5, 4, 622-631, https://doi.org/10.1109/JSEN.2005.850990
. [all data]
Staples, 2004
Staples, E.J.,
Analysis of odors from explosives using an electronic nose, 2004, retrieved from http://www.estcal.com/TechPapers/OdorsofExplosives.doc. [all data]