2-Phenylvaleronitrile
- Formula: C11H13N
- Molecular weight: 159.2276
- IUPAC Standard InChIKey: VIUPTAFHLRBHBO-UHFFFAOYSA-N
- CAS Registry Number: 5558-78-1
- Chemical structure:
View 3d structure (requires JavaScript / HTML 5) - Other names: Benzeneacetonitrile, α-propyl-

Phase change data

Data compiled by: Robert L. Brown and Stephen E. Stein
Reduced pressure boiling point
Tboil (K) | Pressure (bar) | Reference |
---|---|---|
399.7 | 0.017 | Weast and Grasselli, 1989 |
398. to 401. | 0.017 | Frinton Laboratories Inc., 1986 |

References

Weast and Grasselli, 1989
CRC Handbook of Data on Organic Compounds, 2nd Editon, Weast,R.C and Grasselli, J.G., ed(s)., CRC Press, Inc., Boca Raton, FL, 1989, 1. [all data]
Frinton Laboratories Inc., 1986
Frinton Laboratories Inc.,
Catalog Number 11, Frinton Laboratories Inc., Vineland, NJ, 1986, 99. [all data]