2-Heptene, 2,6-dimethyl-
- Formula: C9H18
- Molecular weight: 126.2392
- IUPAC Standard InChIKey: JDJYGSMZGYTCML-UHFFFAOYSA-N
- CAS Registry Number: 5557-98-2
- Chemical structure:
View 3d structure (requires JavaScript / HTML 5) - Other names: 2,6-Dimethyl-2-heptene

Phase change data

Data compiled by: Thermodynamics Research Center, NIST Boulder Laboratories, Chris Muzny director
Quantity | Value | Units | Method | Reference | Comment |
---|---|---|---|---|---|
Tboil | 409. | K | N/A | Paul, 1941 | Uncertainty assigned by TRC = 3. K |

Kovats' RI, non-polar column, isothermal

Column type | Active phase | Temperature (C) | I | Reference | Comment |
---|---|---|---|---|---|
Capillary | Squalane | 100. | 850. | Lulova, Leont'eva, et al., 1976 | He; Column length: 120. m; Column diameter: 0.25 mm |
Capillary | Squalane | 55. | 850. | Lulova, Leont'eva, et al., 1975 | He; Column length: 120. m; Column diameter: 0.25 mm |

References

Paul, 1941
Paul, R.,
Bull. Soc. Chim. Fr., 1941, 8, 507. [all data]