2-Penten-4-yn-1-ol
- Formula: C5H6O
- Molecular weight: 82.1005
- IUPAC Standard InChIKey: TWJDCTNDUKKEMU-ONEGZZNKSA-N
- CAS Registry Number: 5557-88-0
- Chemical structure:

Phase change data

Data compiled by: Robert L. Brown and Stephen E. Stein
Reduced pressure boiling point
Tboil (K) | Pressure (atm) | Reference |
---|---|---|
341. to 342. | 0.025 | Farchan Laboratories, 1990 |

References

Farchan Laboratories, 1990
Farchan Laboratories,
Research Chemicals Catalog, Farchan Laboratories, Gainesville, FL, 1990, 91. [all data]