Pargyline
- Formula: C11H13N
- Molecular weight: 159.2276
- IUPAC Standard InChIKey: DPWPWRLQFGFJFI-UHFFFAOYSA-N
- CAS Registry Number: 555-57-7
- Chemical structure:

Phase change data

Data compiled by: Robert L. Brown and Stephen E. Stein
Reduced pressure boiling point
Tboil (K) | Pressure (bar) | Reference |
---|---|---|
360.2 | 0.005 | Aldrich Chemical Company Inc., 1990 |
369.7 | 0.015 | Weast and Grasselli, 1989 |

Normal alkane RI, polar column, isothermal

Data compiled by: NIST Mass Spectrometry Data Center, William E. Wallace, director

Column type CapillaryCapillaryCapillary
Active phase Carbowax 20M / KOHCarbowax 20M / KOHCarbowax 20M / KOH
Column length (m)
Carrier gas
Substrate
Column diameter (mm)
Phase thickness (μm)
Temperature (C) 150.150.150.
I 1759.1762.1771.
ReferenceCaddy, Fish, et al., 1973Caddy, Fish, et al., 1973Caddy, Fish, et al., 1973
Comment MSDC-RI MSDC-RI MSDC-RI

Kovats' RI, non-polar column, isothermal

View large format table.

Column type Active phase Temperature (C) I Reference Comment
PackedOV-101150.1232.Huber, Kenndler, et al., 1979N2; Column length: 2. m
PackedApiezon L120.1216.Huber, Kenndler, et al., 1979
PackedApiezon L120.1216.Donike and Stratmann, 1976Chromosorb W

Van Den Dool and Kratz RI, non-polar column, temperature ramp

View large format table.

Column type Active phase I Reference Comment
PackedSE-301215.Perrigo and Peel, 1981N2, Chromosorb W, 130. C @ 2. min, 8. K/min, 290. C @ 8. min; Column length: 1.8 m

Normal alkane RI, non-polar column, isothermal

View large format table.

Column type Active phase Temperature (C) I Reference Comment
CapillaryApieson L / KOH150.1215.Caddy, Fish, et al., 1973
CapillaryApieson L / KOH150.1220.Caddy, Fish, et al., 1973
CapillaryApieson L / KOH150.1227.Caddy, Fish, et al., 1973

Normal alkane RI, non-polar column, custom temperature program

View large format table.

Column type Active phase I Reference Comment
OtherMethyl Silicone1214.Ardrey and Moffat, 1981Program: not specified

References

Aldrich Chemical Company Inc., 1990
Aldrich Chemical Company Inc.,
Catalog Handbook of Fine Chemicals, Aldrich Chemical Company, Inc., Milwaukee WI, 1990, 1. [all data]
Weast and Grasselli, 1989
CRC Handbook of Data on Organic Compounds, 2nd Editon, Weast,R.C and Grasselli, J.G., ed(s)., CRC Press, Inc., Boca Raton, FL, 1989, 1. [all data]
Lang (editor), 1965
Lang (editor), L.,
Absorption Spectra in the Ultraviolet and Visible Region, 1965, 5, 9. [all data]