Tristearin
- Formula: C57H110O6
- Molecular weight: 891.4797
- IUPAC Standard InChIKey: DCXXMTOCNZCJGO-UHFFFAOYSA-N
- CAS Registry Number: 555-43-1
- Chemical structure:

Condensed phase thermochemistry data

Data compiled as indicated in comments:
DH - Eugene S. Domalski and Elizabeth D. Hearing
ALS - Hussein Y. Afeefy, Joel F. Liebman, and Stephen E. Stein
Quantity | Value | Units | Method | Reference | Comment |
---|---|---|---|---|---|
S°liquid | 366.80 | cal/mol*K | N/A | Charbonnet and Singleton, 1947 | For c,β: extrapolation below 90 K, 462.8 J/mol*K.; DH |
Quantity | Value | Units | Method | Reference | Comment |
ΔcH°solid | -8558.00 ± 0.44 | kcal/mol | Ccb | Freedman, Bagby, et al., 1989 | Corresponding ΔfHºsolid = -560.24 kcal/mol (simple calculation by NIST; no Washburn corrections); ALS |
Constant pressure heat capacity of liquid
Cp,liquid (cal/mol*K) | Temperature (K) | Reference | Comment |
---|---|---|---|
472.0 | 353. | Phillips and Mattamal, 1976 | T = 353 to 453 K.; DH |
470.60 | 346.5 | Charbonnet and Singleton, 1947 | T = 96 to 372 K. Value is unsmoothed experimental datum. Data for c,α, 192 to 226 K.; DH |

Phase change data

Data compiled as indicated in comments:
TRC - Thermodynamics Research Center, NIST Boulder Laboratories, Chris Muzny director
AC - William E. Acree, Jr., James S. Chickos
DH - Eugene S. Domalski and Elizabeth D. Hearing
Quantity | Value | Units | Method | Reference | Comment |
---|---|---|---|---|---|
Tfus | 344.6 | K | N/A | Cheshko and Shvaika, 1971 | Uncertainty assigned by TRC = 2. K; TRC |
Tfus | 330. | K | N/A | Tammann, 1913 | Uncertainty assigned by TRC = 1. K; TRC |
Quantity | Value | Units | Method | Reference | Comment |
Ttriple | 336.7 | K | N/A | Ollivon and Perron, 1982 | Crystal phase 2 phase; Uncertainty assigned by TRC = 1. K; TRC |
Ttriple | 346.3 | K | N/A | Ollivon and Perron, 1982 | Crystal phase 1 phase; Uncertainty assigned by TRC = 1. K; TRC |
Ttriple | 328.3 | K | N/A | Ollivon and Perron, 1982 | Crystal phase 3 phase; Uncertainty assigned by TRC = 1. K; TRC |
Ttriple | 327.2 | K | N/A | Charbonnet and Singleton, 1947, 2 | Crystal phase 2 phase; Uncertainty assigned by TRC = 0.2 K; TRC |
Ttriple | 345.7 | K | N/A | Charbonnet and Singleton, 1947, 2 | Crystal phase 1 phase; Uncertainty assigned by TRC = 0.2 K; TRC |
Quantity | Value | Units | Method | Reference | Comment |
ΔvapH° | 56.5 ± 2.0 | kcal/mol | TGA | Kishore, Shobha, et al., 1990 | AC |
Enthalpy of vaporization
ΔvapH (kcal/mol) | Temperature (K) | Method | Reference | Comment |
---|---|---|---|---|
41.80 | 506. | TGA | Kishore, Shobha, et al., 1990 | AC |
40.03 | 536. | A,T | Stephenson and Malanowski, 1987 | Based on data from 521. to 588. K. See also Perry, Weber, et al., 1949.; AC |
Enthalpy of fusion
ΔfusH (kcal/mol) | Temperature (K) | Reference | Comment |
---|---|---|---|
48.580 | 345.7 | Domalski and Hearing, 1996 | AC |
Enthalpy of phase transition
ΔHtrs (kcal/mol) | Temperature (K) | Initial Phase | Final Phase | Reference | Comment |
---|---|---|---|---|---|
34.6750 | 327.2 | crystaline, α | liquid | Charbonnet and Singleton, 1947 | DH |
48.5803 | 345.7 | crystaline, β | liquid | Charbonnet and Singleton, 1947 | DH |
Entropy of phase transition
ΔStrs (cal/mol*K) | Temperature (K) | Initial Phase | Final Phase | Reference | Comment |
---|---|---|---|---|---|
106.0 | 327.2 | crystaline, α | liquid | Charbonnet and Singleton, 1947 | DH |
140.5 | 345.7 | crystaline, β | liquid | Charbonnet and Singleton, 1947 | DH |

Reaction thermochemistry data

Data compiled by: Hussein Y. Afeefy, Joel F. Liebman, and Stephen E. Stein
Individual Reactions
By formula: C57H104O6 + 3H2 = C57H110O6
Quantity | Value | Units | Method | Reference | Comment |
---|---|---|---|---|---|
ΔrH° | -380.55 | kcal/mol | Chyd | Rogers and Choudhury, 1978 | liquid phase; solvent: Hexane |
9 + C57H92O6 =
By formula: 9H2 + C57H92O6 = C57H110O6
Quantity | Value | Units | Method | Reference | Comment |
---|---|---|---|---|---|
ΔrH° | -270.67 | kcal/mol | Chyd | Rogers and Choudhury, 1978 | liquid phase; solvent: Hexane |
By formula: 3H2 + C57H104O6 = C57H110O6
Quantity | Value | Units | Method | Reference | Comment |
---|---|---|---|---|---|
ΔrH° | -376.9 | kcal/mol | Chyd | Rogers and Choudhury, 1978 | liquid phase; solvent: Hexane |
By formula: 3H2 + C57H104O6 = C57H110O6
Quantity | Value | Units | Method | Reference | Comment |
---|---|---|---|---|---|
ΔrH° | -90.356 | kcal/mol | Chyd | Rogers and Choudhury, 1978 | liquid phase; solvent: Hexane |
By formula: 6H2 + C57H98O6 = C57H110O6
Quantity | Value | Units | Method | Reference | Comment |
---|---|---|---|---|---|
ΔrH° | -180.94 | kcal/mol | Chyd | Rogers and Choudhury, 1978 | liquid phase; solvent: Hexane |

References

Charbonnet and Singleton, 1947
Charbonnet, G.H.; Singleton, W.S.,
Thermal properties of fats and oils. VI. Heat capacity, heats of fusion and transition, and entropy of trilaurin, trimyristin, tripalmitin, and tristearin,
J. Am. Oil Chem. Soc., 1947, 24, 140-142. [all data]
Freedman, Bagby, et al., 1989
Freedman, B.; Bagby, M.O.; Khoury, H.,
Correlation of heats of combustion with empirical formulas for fatty alcohols,
J. Am. Oil Chem. Soc., 1989, 66, 595-596. [all data]
Phillips and Mattamal, 1976
Phillips, J.C.; Mattamal, M.M.,
Correlation of liquid heat capacities for carboxylic esters,
J. Chem. Eng. Data, 1976, 21, 228-232. [all data]
Cheshko and Shvaika, 1971
Cheshko, F.F.; Shvaika, T.N.,
Syntheses and Identification of Esters of Certain Mono- and Di-carboxylic Acids,
Zh. Prikl. Khim., 1971, 44, 1107-16. [all data]
Tammann, 1913
Tammann, G.,
Nachr. Ges. Wiss. Goettingen, Math.-Phys. Kl., 1913, 1913, 335. [all data]
Ollivon and Perron, 1982
Ollivon, M.; Perron, R.,
Thermochim. Acta, 1982, 53, 183-194. [all data]
Charbonnet and Singleton, 1947, 2
Charbonnet, G.H.; Singleton, W.S.,
Thermal properties of fats and oils. VI. Heat capacity, heats of fusion,
J. Am. Oil Chem. Soc., 1947, 24, 140. [all data]
Kishore, Shobha, et al., 1990
Kishore, K.; Shobha, H.K.; Mattamal, G.J.,
Structural effects on the vaporization of high molecular weight esters,
J. Phys. Chem., 1990, 94, 4, 1642-1648, https://doi.org/10.1021/j100367a077
. [all data]
Stephenson and Malanowski, 1987
Stephenson, Richard M.; Malanowski, Stanislaw,
Handbook of the Thermodynamics of Organic Compounds, 1987, https://doi.org/10.1007/978-94-009-3173-2
. [all data]
Perry, Weber, et al., 1949
Perry, E.S.; Weber, W.H.; Daubert, B.F.,
Vapor Pressures of Phlegmatic Liquids. I. Simple and Mixed Triglycerides,
J. Am. Chem. Soc., 1949, 71, 11, 3720-3726, https://doi.org/10.1021/ja01179a038
. [all data]
Domalski and Hearing, 1996
Domalski, Eugene S.; Hearing, Elizabeth D.,
Heat Capacities and Entropies of Organic Compounds in the Condensed Phase. Volume III,
J. Phys. Chem. Ref. Data, 1996, 25, 1, 1, https://doi.org/10.1063/1.555985
. [all data]
Rogers and Choudhury, 1978
Rogers, D.W.; Choudhury, D.N.,
Heats of hydrogenation of large molecules. Part 3 - Five simple unsaturated triglycerides (triacylglycerols),
J. Chem. Soc. Faraday Trans. 1, 1978, 74, 2868-2872. [all data]