Butanoic acid, heptafluoro-, 4-[2-[(2,2,3,3,4,4,4-heptafluoro-1-oxobutyl)amino]ethyl]-1,2-phenylene ester
- Formula: C20H8F21NO5
- Molecular weight: 741.2477
- IUPAC Standard InChIKey: HQCGNAGTHKEFMI-UHFFFAOYSA-N
- CAS Registry Number: 55538-89-1
- Chemical structure:
View 3d structure (requires JavaScript / HTML 5) - Other names: Dopamine, tris (N,O,O-HFB); Dopamine HFB; 3-Hydroxytyramine, N,O,O'-tris(heptafluorobutyryl)-

Van Den Dool and Kratz RI, non-polar column, custom temperature program

Column type | Active phase | I | Reference | Comment |
---|---|---|---|---|
Capillary | VF-5MS | 1660. | Tretyakov, 2011 | 30. m/0.25 mm/0.25 μm, He; Program: Multi-step temperature program; T(initial)=60C; T(final)=270C |

References

Tretyakov, 2011
Tretyakov, K.V.,
Retention Data. NIST Mass Spectrometry Data Center., NIST Mass Spectrometry Data Center, 2011. [all data]