aluminium triisopropanolate

Condensed phase thermochemistry data

Data compiled by: José A. Martinho Simões

Quantity Value Units Method Reference Comment
Δfsolid-1149.1 ± 1.6kJ/molReviewMartinho Simões
Quantity Value Units Method Reference Comment
Δcsolid-6231.6 ± 0.8kJ/molCC-SBGenchel, Golovin, et al., 1981The enthalpy of combustion was calculated from data in Genchel, Golovin, et al., 1981.

References

Martinho Simões
Martinho Simões, J.A., Private communication (see http://webbook.nist.gov/chemistry/om/). [all data]

Genchel, Golovin, et al., 1981
Genchel, V.K.; Golovin, V.I.; Fedorov, A.K.; Shaulov, Yu.Kh., Russ. J. Phys. Chem., 1981, 55, 460. [all data]