Aconitic acid, (Z)-, 3TMS derivative
- Formula: C15H30O6Si3
- Molecular weight: 390.6516
- IUPAC Standard InChIKey: RHDPKJMZPKZKTA-BENRWUELSA-N
- CAS Registry Number: 55530-71-7
- Chemical structure:
View 3d structure (requires JavaScript / HTML 5) - Stereoisomers:
- Other names: 1-Propene-1,2,3-tricarboxylic acid, tris(trimethylsilyl) ester, (Z)-; cis-Aconitic acid (3TMS); cis-Aconitic acid, tris(trimethylsilyl) ester; (Z)-Aconitic acid, tris-TMS; (Z)-Aconitic acid, 3TMS; Tris(trimethylsilyl) (1Z)-1-propene-1,2,3-tricarboxylate; cis-Aconitic acid, TMS; (Z)-Aconitic acid, TMS

Van Den Dool and Kratz RI, non-polar column, temperature ramp

Column type | Active phase | I | Reference | Comment |
---|---|---|---|---|
Capillary | CP Sil 5 CB | 1749. | Wurth, Kumps, et al., 1989 | N2, 60. C @ 0.5 min, 6. K/min, 280. C @ 5. min |
Packed | OV-1 | 1754. | Tanaka, Hine, et al., 1980 | N2, 100-120 mesh, 70. C @ 0.5 min, 28. K/min; Column length: 1.8 m; Tend: 290. C |

Van Den Dool and Kratz RI, non-polar column, custom temperature program

Column type | Active phase | I | Reference | Comment |
---|---|---|---|---|
Capillary | HP-5MS | 1741.4 | Andriamaharavo, 2014 | 30. m/0.25 mm/0.25 μm, He; Program: 60C (1 min) => 5 C/min => 210C => 10 C/min => 280C (15 min) |
Capillary | Polydimethyl siloxane with 5 % phenyl groups | 1742. | Kempa, Hummel, et al., 2009 | Program: not specified |
Capillary | VF-5MS | 1735.7 | Tret'yakov, 2007 | 30. m/0.25 mm/0.25 μm, He; Program: Multi-step temperature program; T(initial)=60C; T(final)=270C |
Capillary | DB-1 | 1744. | Tsai, Oliphant, et al., 1985 | He; Program: not specified |
Packed | OV-101 | 1754. | Tanaka and Hine, 1982 | Program: not specified |

Normal alkane RI, non-polar column, temperature ramp

Column type | Active phase | I | Reference | Comment |
---|---|---|---|---|
Capillary | HP-5MS | 1733. | Lee, Yanamandra, et al., 2002 | 30. m/0.25 mm/0.25 μm, He, 70. C @ 3. min, 4. K/min, 280. C @ 3. min |

References

Wurth, Kumps, et al., 1989
Wurth, C.; Kumps, A.; Mardens, Y.,
Urinary organic acids: Retention indices on two capillary gas chromatography columns,
J. Chromatogr., 1989, 491, 186-192, https://doi.org/10.1016/S0378-4347(00)82831-5
. [all data]
Tanaka, Hine, et al., 1980
Tanaka, K.; Hine, D.G.; West-Dull, A.; Lynn, T.B.,
Gas-chromatographic method of analysis for urinary organic acids. I. Retention indices of 155 metabolically important compounds,
Clin. Chem., 1980, 26, 13, 1839-1846. [all data]
Andriamaharavo, 2014
Andriamaharavo, N.R.,
Retention Data. NIST Mass Spectrometry Data Center., NIST Mass Spectrometry Data Center, 2014. [all data]
Kempa, Hummel, et al., 2009
Kempa, S.; Hummel, J.; Schwemmer, T.; Pietzke, M.; Strehmel, N.; Wienkoop, S.; Kopka, J.; Weckwerth, W.,
An automated GCxGC-TOF-MS protocol for batch-wise extraction and alinmebt of mass isotopomer matrixes from differential 13C-labeling experiments: a case study for photoautotrophic-mixotrophic grown Chlamydomonas reinhardtii cells,
J. Basic Microbiol., 2009, 49, 1, 82-91, https://doi.org/10.1002/jobm.200800337
. [all data]
Tret'yakov, 2007
Tret'yakov, K.V.,
Retention Data. NIST Mass Spectrometry Data Center., NIST Mass Spectrometry Data Center, 2007. [all data]
Tsai, Oliphant, et al., 1985
Tsai, M.Y.; Oliphant, C.; Josephson, M.W.,
Identification of Metabolites Diagnostic for Organic Acidurias by Simultaneous Dual-Column Capillary Gas Chromatography,
J. Chromatogr., 1985, 341, 1-10, https://doi.org/10.1016/S0378-4347(00)84004-9
. [all data]
Tanaka and Hine, 1982
Tanaka, K.; Hine, D.G.,
Compilation of Gas Chromatographic Retention Indices of 163 Metabolically Important Organic Acids, and Their Use in Detection of Patients with Organic Acidurias,
J. Chromatogr., 1982, 239, 301-322, https://doi.org/10.1016/S0021-9673(00)81990-1
. [all data]
Lee, Yanamandra, et al., 2002
Lee, B.Y.; Yanamandra, K.; Thurmon, T.F.,
Quantitative estimation of organic analytes with a capillary column,
Am. Clin. Lab., 2002, May, 30-34. [all data]