Gluconolactone (3R,4S,5R,6R)-, 4TMS derivative
- Formula: C18H42O6Si4
- Molecular weight: 466.8645
- IUPAC Standard InChIKey: VNGTZLYNGGLPIZ-QBPKDAKJSA-N
- CAS Registry Number: 55515-29-2
- Chemical structure:
View 3d structure (requires JavaScript / HTML 5) - Stereoisomers:
- Other names: Gluconic acid, 2,3,4,6-tetrakis-O-(trimethylsilyl)-, lactone; Gluconic acid, 1,5-lactone, tetrakis-TMS; Glucono-1,5-lactone, tetrakis-TMS; Gluconolactone, (4TMS); Gluconolactone, tetrakis-O-TMS; Gluconolactone, TMS; Gluconic acid, 1,5-lactone, TMS

Kovats' RI, non-polar column, isothermal

Column type | Active phase | Temperature (C) | I | Reference | Comment |
---|---|---|---|---|---|
Packed | OV-1 | 160. | 1919. | Petersson, 1977 | N2, Chromosorb G (100-120 mesh); Column length: 2. m |

Van Den Dool and Kratz RI, non-polar column, temperature ramp

Column type | Active phase | I | Reference | Comment |
---|---|---|---|---|
Capillary | Ultra-2 | 1916. | Tuchman, Bowers, et al., 1984 | 25. m/0.31 mm/0.52 μm, He, 5. K/min; Tstart: 50. C; Tend: 300. C |

References

Petersson, 1977
Petersson, G.,
Retention Data in GLC Analysis; Carbohydrate-Related Hydroxy Carboxylic and Dicarboxylic Acids as Trimethylsilyl Derivatives,
J. Chromatogr. Sci., 1977, 15, 7, 245-255, https://doi.org/10.1093/chromsci/15.7.245
. [all data]
Tuchman, Bowers, et al., 1984
Tuchman, M.; Bowers, L.D.; Fregien, K.D.; Crippin, P.J.; Krivit, W.,
Capillary Gas Chromatographic Separation of Urinary Organic Acids. Retention Indices of 101 Urinary Acids on a 5% Phenylmethyl Silicone Capillary Column,
J. Chromatogr. Sci., 1984, 22, 5, 198-202, https://doi.org/10.1093/chromsci/22.5.198
. [all data]