Mannonic acid, lactone - 4TMS derivative
- Formula: C18H42O6Si4
- Molecular weight: 466.8645
- IUPAC Standard InChIKey: VNGTZLYNGGLPIZ-VQHPVUNQSA-N
- CAS Registry Number: 55515-28-1
- Chemical structure:
View 3d structure (requires JavaScript / HTML 5) - Stereoisomers:
- Other names: Mannonic acid, 2,3,4,6-tetrakis-O-(trimethylsilyl)-, lactone; Mannonic acid, 1,5-lactone, tetrakis-TMS; Mannonic acid, δ-lactone, tetrakis-TMS ether; Mannonic acid, 1,5-lactone, tetrakis-O-TMS ether; Mannonic acid, 1,5-lactone, TMS

Kovats' RI, non-polar column, isothermal

Column type | Active phase | Temperature (C) | I | Reference | Comment |
---|---|---|---|---|---|
Packed | OV-1 | 160. | 1912. | Petersson, 1977 | N2, Chromosorb G (100-120 mesh); Column length: 2. m |

References

Petersson, 1977
Petersson, G.,
Retention Data in GLC Analysis; Carbohydrate-Related Hydroxy Carboxylic and Dicarboxylic Acids as Trimethylsilyl Derivatives,
J. Chromatogr. Sci., 1977, 15, 7, 245-255, https://doi.org/10.1093/chromsci/15.7.245
. [all data]