gentiobiose
- Formula: C12H22O11
- Molecular weight: 342.2965
- IUPAC Standard InChIKey: DLRVVLDZNNYCBX-CAPXFGMSSA-N
- CAS Registry Number: 554-91-6
- Chemical structure:
View 3d structure (requires JavaScript / HTML 5) - Permanent link for this species. Use this link for bookmarking this species for future reference.

Reaction thermochemistry data

Data compiled by: Robert C. Dunbar
Individual Reactions
By formula: Na+ + C12H22O11 = (Na+ • C12H22O11)
Quantity | Value | Units | Method | Reference | Comment |
---|---|---|---|---|---|
ΔrH° | 201. | kJ/mol | CIDC | Cerda and Wesdemiotis, 1999 |
Free energy of reaction
ΔrG° (kJ/mol) | T (K) | Method | Reference |
---|---|---|---|
0.0 | 298. | CIDC | Cerda and Wesdemiotis, 1999 |

Ion clustering data

Data compiled by: Robert C. Dunbar
Clustering reactions
By formula: Na+ + C12H22O11 = (Na+ • C12H22O11)
Quantity | Value | Units | Method | Reference | Comment |
---|---|---|---|---|---|
ΔrH° | 201. | kJ/mol | CIDC | Cerda and Wesdemiotis, 1999 |
Free energy of reaction
ΔrG° (kJ/mol) | T (K) | Method | Reference |
---|---|---|---|
0.0 | 298. | CIDC | Cerda and Wesdemiotis, 1999 |

References

Cerda and Wesdemiotis, 1999
Cerda, B.A.; Wesdemiotis, C.,
Thermochemistry and Structures of Na+ Coordinated Mono- and Disaccharide Stereoisomers,
Int. J. Mass Spectrom., 1999, 189, 2-3, 189, https://doi.org/10.1016/S1387-3806(99)00085-8
. [all data]