Eicosane, 10-heptyl-10-octyl-
- Formula: C35H72
- Molecular weight: 492.9462
- IUPAC Standard InChIKey: FEIFRHBKEQKLTC-UHFFFAOYSA-N
- CAS Registry Number: 55470-98-9
- Chemical structure:
View 3d structure (requires JavaScript / HTML 5) - Other names: 10-n-Heptyl-10-n-octyleicosane

Phase change data

Data compiled by: Thermodynamics Research Center, NIST Boulder Laboratories, Chris Muzny director
Quantity | Value | Units | Method | Reference | Comment |
---|---|---|---|---|---|
Tfus | 200. | K | N/A | Rabjohn, 1955 | Uncertainty assigned by TRC = 2. K |

References

Rabjohn, 1955
Rabjohn, N.,
Unpublished, Univ. of Missouri, Columbus, 1955. [all data]