Benzeneethanamine, N-[(pentafluorophenyl)methylene]-β,4-bis[(trimethylsilyl)oxy]-

Normal alkane RI, non-polar column, custom temperature program

View large format table.

Column type Active phase I Reference Comment
PackedSE-302159.Moffat and Horning, 1970Ar; Column length: 3.7 m; Program: not specified

References

Moffat and Horning, 1970
Moffat, A.C.; Horning, E.C., A new derivative for the gas-liquid chromatography pf picogram quantities of promary amines of the catecholamine series, Biochim. Biophys. Acta, 1970, 222, 1, 248-250, https://doi.org/10.1016/0304-4165(70)90379-X . [all data]