Tetracosane, 11-decyl-
- Formula: C34H70
- Molecular weight: 478.9196
- IUPAC Standard InChIKey: BVMGLUHWZZEDRX-UHFFFAOYSA-N
- CAS Registry Number: 55429-84-0
- Chemical structure:
View 3d structure (requires JavaScript / HTML 5) - Other names: 11-n-Decyltetracosane; 11-Decyltetracosane

Phase change data

Data compiled as indicated in comments:
TRC - Thermodynamics Research Center, NIST Boulder Laboratories, Chris Muzny director
AC - William E. Acree, Jr., James S. Chickos
Quantity | Value | Units | Method | Reference | Comment |
---|---|---|---|---|---|
Tfus | 284.0 | K | N/A | Foehr and Fenske, 1949 | Uncertainty assigned by TRC = 1. K; TRC |
Tfus | 284.0 | K | N/A | Schiessler, 1947 | Uncertainty assigned by TRC = 1. K; TRC |
Enthalpy of vaporization
ΔvapH (kJ/mol) | Temperature (K) | Method | Reference | Comment |
---|---|---|---|---|
113.1 | 552. | A,MG | Stephenson and Malanowski, 1987 | Based on data from 537. to 574. K. See also Schiessler and Whitmore, 1955.; AC |

References

Foehr and Fenske, 1949
Foehr, E.G.; Fenske, M.R.,
Magneto-optic Rotation of Hydrocarbons,
Ind. Eng. Chem., 1949, 41, 1956. [all data]
Schiessler, 1947
Schiessler, R.W.,
, Am. Pet. Inst. Res. Proj. 42, Twelfth Meeting, 1947. [all data]
Stephenson and Malanowski, 1987
Stephenson, Richard M.; Malanowski, Stanislaw,
Handbook of the Thermodynamics of Organic Compounds, 1987, https://doi.org/10.1007/978-94-009-3173-2
. [all data]
Schiessler and Whitmore, 1955
Schiessler, R.W.; Whitmore, F.C.,
Properties of High Molecular Weight Hydrocarbons,
Ind. Eng. Chem., 1955, 47, 8, 1660-1665, https://doi.org/10.1021/ie50548a054
. [all data]