Cyclopentane, 1,1'-[4-(3-cyclopentylpropyl)-1,7-heptanediyl]bis-
- Formula: C25H46
- Molecular weight: 346.6327
- IUPAC Standard InChIKey: GGMFQOVCHUDPGX-UHFFFAOYSA-N
- CAS Registry Number: 55429-35-1
- Chemical structure:
View 3d structure (requires JavaScript / HTML 5) - Other names: 1,7-Dicyclopentyl-4-(3-cyclopentylpropyl)heptane

Phase change data

Data compiled as indicated in comments:
TRC - Thermodynamics Research Center, NIST Boulder Laboratories, Chris Muzny director
AC - William E. Acree, Jr., James S. Chickos
Quantity | Value | Units | Method | Reference | Comment |
---|---|---|---|---|---|
Tfus | 249.45 | K | N/A | Anonymous, 1968 | Uncertainty assigned by TRC = 0.5 K; TRC |
Tfus | 249.5 | K | N/A | Foehr and Fenske, 1949 | Uncertainty assigned by TRC = 2. K; TRC |
Enthalpy of vaporization
ΔvapH (kJ/mol) | Temperature (K) | Method | Reference | Comment |
---|---|---|---|---|
87.6 | 472. | A | Stephenson and Malanowski, 1987 | Based on data from 457. to 525. K.; AC |
88.9 | 501. | A,MG | Stephenson and Malanowski, 1987 | Based on data from 486. to 525. K. See also Schiessler and Whitmore, 1955.; AC |

References

Anonymous, 1968
Anonymous, R.,
Properties of hydrocarbon of high molecular weight, Am. Pet. Inst. Res. Proj. 42, Penn. State Univ., 1968. [all data]
Foehr and Fenske, 1949
Foehr, E.G.; Fenske, M.R.,
Magneto-optic Rotation of Hydrocarbons,
Ind. Eng. Chem., 1949, 41, 1956. [all data]
Stephenson and Malanowski, 1987
Stephenson, Richard M.; Malanowski, Stanislaw,
Handbook of the Thermodynamics of Organic Compounds, 1987, https://doi.org/10.1007/978-94-009-3173-2
. [all data]
Schiessler and Whitmore, 1955
Schiessler, R.W.; Whitmore, F.C.,
Properties of High Molecular Weight Hydrocarbons,
Ind. Eng. Chem., 1955, 47, 8, 1660-1665, https://doi.org/10.1021/ie50548a054
. [all data]