Thiophene, 2-methyl-
- Formula: C5H6S
- Molecular weight: 98.166
- IUPAC Standard InChIKey: XQQBUAPQHNYYRS-UHFFFAOYSA-N
- CAS Registry Number: 554-14-3
- Chemical structure:
View 3d structure (requires JavaScript / HTML 5) - Other names: 2-Methylthiophene; 2-Methylthiacyclopentadiene; 2-methylthiacyclopentadiene (2-methylthiophene)

Gas phase thermochemistry data

Data compiled by: Hussein Y. Afeefy, Joel F. Liebman, and Stephen E. Stein
Quantity | Value | Units | Method | Reference | Comment |
---|---|---|---|---|---|
ΔfH°gas | 20.16 ± 0.22 | kcal/mol | Ccr | Pennington, Finke, et al., 1956 |

Condensed phase thermochemistry data

Data compiled as indicated in comments:
ALS - Hussein Y. Afeefy, Joel F. Liebman, and Stephen E. Stein
DH - Eugene S. Domalski and Elizabeth D. Hearing
Quantity | Value | Units | Method | Reference | Comment |
---|---|---|---|---|---|
ΔfH°liquid | 10.66 ± 0.22 | kcal/mol | Ccr | Pennington, Finke, et al., 1956 | Reanalyzed by Cox and Pilcher, 1970, Original value = 10.86 ± 0.21 kcal/mol; ALS |
Quantity | Value | Units | Method | Reference | Comment |
ΔcH°liquid | -829.82 ± 0.18 | kcal/mol | Ccr | Pennington, Finke, et al., 1956 | Reanalyzed by Cox and Pilcher, 1970, Original value = -829.65 ± 0.18 kcal/mol; ALS |
Quantity | Value | Units | Method | Reference | Comment |
S°liquid | 52.220 | cal/mol*K | N/A | Pennington, Finke, et al., 1956 | DH |
Constant pressure heat capacity of liquid
Cp,liquid (cal/mol*K) | Temperature (K) | Reference | Comment |
---|---|---|---|
35.810 | 298.15 | Pennington, Finke, et al., 1956 | T = 12 to 340 K.; DH |
Constant pressure heat capacity of solid
Cp,solid (cal/mol*K) | Temperature (K) | Reference | Comment |
---|---|---|---|
23.40 | 199.70 | Carlson and Westrum, 1968 | glass phase; T = 110 to 200 K. Value is unsmoothed experimental datum.; DH |

Phase change data

Data compiled as indicated in comments:
BS - Robert L. Brown and Stephen E. Stein
TRC - Thermodynamics Research Center, NIST Boulder Laboratories, Chris Muzny director
AC - William E. Acree, Jr., James S. Chickos
DRB - Donald R. Burgess, Jr.
ALS - Hussein Y. Afeefy, Joel F. Liebman, and Stephen E. Stein
DH - Eugene S. Domalski and Elizabeth D. Hearing
Quantity | Value | Units | Method | Reference | Comment |
---|---|---|---|---|---|
Tboil | 385.8 | K | N/A | Weast and Grasselli, 1989 | BS |
Tboil | 385.7 | K | N/A | Majer and Svoboda, 1985 | |
Tboil | 385.15 | K | N/A | Levi and Nicholls, 1958 | Uncertainty assigned by TRC = 1.5 K; TRC |
Tboil | 386. | K | N/A | Haines, Helm, et al., 1956 | Uncertainty assigned by TRC = 0.3 K; TRC |
Quantity | Value | Units | Method | Reference | Comment |
Tfus | 209.77 | K | N/A | Haines, Helm, et al., 1956 | Uncertainty assigned by TRC = 0.06 K; TRC |
Quantity | Value | Units | Method | Reference | Comment |
Ttriple | 209.79 | K | N/A | Pennington, Finke, et al., 1956, 2 | Uncertainty assigned by TRC = 0.05 K; extrapolate 1/f to zero; TRC |
Quantity | Value | Units | Method | Reference | Comment |
Tc | 606.2 | K | N/A | Majer and Svoboda, 1985 | |
Quantity | Value | Units | Method | Reference | Comment |
ΔvapH° | 9.300 | kcal/mol | N/A | Majer and Svoboda, 1985 | |
ΔvapH° | 9.25 | kcal/mol | N/A | Reid, 1972 | AC |
ΔvapH° | 9.51 | kcal/mol | N/A | Pennington, Finke, et al., 1956 | DRB |
Enthalpy of vaporization
ΔvapH (kcal/mol) | Temperature (K) | Method | Reference | Comment |
---|---|---|---|---|
8.10 | 385.7 | N/A | Majer and Svoboda, 1985 | |
8.89 | 339. | A,EB | Stephenson and Malanowski, 1987 | Based on data from 324. to 391. K. See also White, Barnard--Smith, et al., 1952 and Dykyj, Svoboda, et al., 1999.; AC |
8.80 | 348. | I | Eon, Pommier, et al., 1971 | Based on data from 333. to 373. K. See also Boublik, Fried, et al., 1984.; AC |
9.30 | 343. | V | Pennington, Finke, et al., 1956 | ALS |
Enthalpy of vaporization
ΔvapH =
A exp(-βTr) (1 − Tr)β
ΔvapH =
Enthalpy of vaporization (at saturation pressure)
(kcal/mol)
Tr = reduced temperature (T / Tc)
View plot Requires a JavaScript / HTML 5 canvas capable browser.
Temperature (K) | A (kcal/mol) | β | Tc (K) | Reference | Comment |
---|---|---|---|---|---|
344. to 386. | 12.97 | 0.2853 | 606.2 | Majer and Svoboda, 1985 |
Antoine Equation Parameters
log10(P) = A − (B / (T + C))
P = vapor pressure (atm)
T = temperature (K)
View plot Requires a JavaScript / HTML 5 canvas capable browser.
Temperature (K) | A | B | C | Reference | Comment |
---|---|---|---|---|---|
333.4 to 373.5 | 4.83773 | 1812.35 | -10.276 | Eon, Pommier, et al., 1971 | Coefficents calculated by NIST from author's data. |
Enthalpy of fusion
ΔfusH (kcal/mol) | Temperature (K) | Reference | Comment |
---|---|---|---|
2.6630 | 207.79 | Pennington, Finke, et al., 1956 | DH |
2.26 | 207.8 | Pennington, Finke, et al., 1956 | AC |
Entropy of fusion
ΔfusS (cal/mol*K) | Temperature (K) | Reference | Comment |
---|---|---|---|
12.82 | 207.79 | Pennington, Finke, et al., 1956 | DH |

Henry's Law data

Data compiled by: Rolf Sander
Henry's Law constant (water solution)
kH(T) = k°H exp(d(ln(kH))/d(1/T) ((1/T) - 1/(298.15 K)))
k°H = Henry's law constant for solubility in water at 298.15 K (mol/(kg*bar))
d(ln(kH))/d(1/T) = Temperature dependence constant (K)
k°H (mol/(kg*bar)) | d(ln(kH))/d(1/T) (K) | Method | Reference |
---|---|---|---|
0.42 | 4000. | M | N/A |

Gas phase ion energetics data

Data evaluated as indicated in comments:
HL - Edward P. Hunter and Sharon G. Lias
Data compiled as indicated in comments:
B - John E. Bartmess
LLK - Sharon G. Lias, Rhoda D. Levin, and Sherif A. Kafafi
RDSH - Henry M. Rosenstock, Keith Draxl, Bruce W. Steiner, and John T. Herron
Quantity | Value | Units | Method | Reference | Comment |
---|---|---|---|---|---|
Proton affinity (review) | 205.3 | kcal/mol | N/A | Hunter and Lias, 1998 | HL |
Quantity | Value | Units | Method | Reference | Comment |
Gas basicity | 197.5 | kcal/mol | N/A | Hunter and Lias, 1998 | HL |
Ionization energy determinations
IE (eV) | Method | Reference | Comment |
---|---|---|---|
8.61 | CTS | Aloisi and Pignataro, 1973 | LLK |
8.63 ± 0.05 | EI | Linda, Marino, et al., 1971 | LLK |
8.14 | PE | Baker, Betteridge, et al., 1970 | RDSH |
8.59 | PE | Colonna, Distefano, et al., 1979 | Vertical value; LLK |
De-protonation reactions
C5H5S- + =
By formula: C5H5S- + H+ = C5H6S
Quantity | Value | Units | Method | Reference | Comment |
---|---|---|---|---|---|
ΔrH° | 379.8 ± 3.1 | kcal/mol | G+TS | DePuy, Kass, et al., 1988 | gas phase; Acid: 2-methylthiophene. Between MeOH, EtOH.; B |
Quantity | Value | Units | Method | Reference | Comment |
ΔrG° | 373.0 ± 3.0 | kcal/mol | IMRB | DePuy, Kass, et al., 1988 | gas phase; Acid: 2-methylthiophene. Between MeOH, EtOH.; B |

Kovats' RI, non-polar column, isothermal

Data compiled by: NIST Mass Spectrometry Data Center, William E. Wallace, director

Column type CapillaryCapillaryCapillaryPackedPacked
Active phase SPB-1SE-30OV-101Apiezon MApiezon M
Column length (m) 60.60.60.2.12.1
Carrier gas  HeHeHe or N2
Substrate    Chromosorb W, AW-DMCSChromosorb WAW
Column diameter (mm) 0.320.250.25
Phase thickness (μm) 0.250.500.50
Temperature (C) 100.100.100.130.60.
I 770.770.770.797.773.
ReferenceMisharina, Beletsky, et al., 1994Golovnya, Misharina, et al., 1992Golovnya, Misharina, et al., 1992Garbuzov, Misharina, et al., 1985Mikhailova, Gren, et al., 1985
Comment MSDC-RI MSDC-RI MSDC-RI MSDC-RI MSDC-RI
Column type PackedCapillaryCapillaryCapillaryCapillary
Active phase Apiezon MApiezon LSqualaneSqualaneSqualane
Column length (m) 2.1   50.
Carrier gas     N2
Substrate Chromosorb W, AW/DMS   Celite 545
Column diameter (mm)     0.3
Phase thickness (μm)
Temperature (C) 130.120.120.86.120.
I 797.798.748.746.748.
ReferenceGolovnya, Garbuzov, et al., 1978Agr, Tesaric, et al., 1973Agr, Tesaric, et al., 1973Agr, Tesaric, et al., 1973Agrawal, Tesarík, et al., 1972
Comment MSDC-RI MSDC-RI MSDC-RI MSDC-RI MSDC-RI
Column type CapillaryCapillary
Active phase SqualaneApiezon L
Column length (m) 50.100.
Carrier gas N2N2
Substrate Celite 545
Column diameter (mm) 0.30.3
Phase thickness (μm)
Temperature (C) 86.120.
I 746.798.
ReferenceAgrawal, Tesarík, et al., 1972Agrawal, Tesarík, et al., 1972
Comment MSDC-RI MSDC-RI

Kovats' RI, polar column, isothermal

Data compiled by: NIST Mass Spectrometry Data Center, William E. Wallace, director

Column type Capillary
Active phase Carbowax 40M
Column length (m) 50.
Carrier gas He
Substrate
Column diameter (mm) 0.32
Phase thickness (μm) 0.25
Temperature (C) 100.
I 1112.
ReferenceGolovnya, Misharina, et al., 1992
Comment MSDC-RI

Reaction thermochemistry data

Data compiled by: John E. Bartmess

Individual Reactions

C5H5S- + Hydrogen cation = Thiophene, 2-methyl-

By formula: C5H5S- + H+ = C5H6S

Quantity Value Units Method Reference Comment
Δr379.8 ± 3.1kcal/molG+TSDePuy, Kass, et al., 1988gas phase; Acid: 2-methylthiophene. Between MeOH, EtOH.
Quantity Value Units Method Reference Comment
Δr373.0 ± 3.0kcal/molIMRBDePuy, Kass, et al., 1988gas phase; Acid: 2-methylthiophene. Between MeOH, EtOH.

Normal alkane RI, non-polar column, temperature ramp

Data compiled by: NIST Mass Spectrometry Data Center, William E. Wallace, director

Column type CapillaryCapillaryCapillaryCapillaryCapillary
Active phase MDN-5PONAPONAPONASE-54
Column length (m) 60.50.50.50.25.
Carrier gas HeN2 HeliumHe
Substrate
Column diameter (mm) 0.250.200.200.200.20
Phase thickness (μm) 0.250.500.500.500.50
Tstart (C) 40.35.30.30.35.
Tend (C) 270.170.150.170.250.
Heat rate (K/min) 4.2.2.2.5.
Initial hold (min) 4.   2.
Final hold (min) 5.
I 770.753.749.752.776.
Referencevan Loon, Linssen, et al., 2005Yang, Wang, et al., 2004Yang, Wang, et al., 2003Yang, Yang, et al., 2003Bellesia, Pinetti, et al., 2001
Comment MSDC-RI MSDC-RI MSDC-RI MSDC-RI MSDC-RI
Column type CapillaryCapillaryCapillaryCapillaryCapillary
Active phase HP-5DB-1DB-5CP-Sil 5CP-Sil 5
Column length (m) 50.60.60.25.25.
Carrier gas  HeHeHeliumHelium
Substrate
Column diameter (mm) 0.320.320.250.320.32
Phase thickness (μm) 0.521.0 0.450.45
Tstart (C) 35.40.40.0.0.
Tend (C) 250.280.160.300.300.
Heat rate (K/min) 2.2.2.3.3.
Initial hold (min) 15. 5.5.5.
Final hold (min) 45.
I 795.767.780.750.750.
ReferenceBoylston and Viniyard, 1998Tai and Ho, 1998Macku and Shibamoto, 1991Damste, van Dalen, et al., 1988Damste, van Dalen, et al., 1988
Comment MSDC-RI MSDC-RI MSDC-RI MSDC-RI MSDC-RI
Column type CapillaryCapillary
Active phase CP Sil 5 CBCP Sil 5 CB
Column length (m) 25.25.
Carrier gas HeHe
Substrate
Column diameter (mm) 0.320.32
Phase thickness (μm) 0.450.45
Tstart (C) 50.50.
Tend (C) 300.300.
Heat rate (K/min) 3.3.
Initial hold (min)
Final hold (min)
I 750.750.
ReferenceDamste, Kock-van Dalen, et al., 1988Damste, Kock-van Dalen, et al., 1988
Comment MSDC-RI MSDC-RI

References

Pennington, Finke, et al., 1956
Pennington, R.E.; Finke, H.L.; Hubbard, W.N.; Messerly, J.F.; Frow, F.R.; Hossenlopp, I.A.; Waddington, G.,
The chemical thermodynamic properties of 2-methylthiophene,
J. Am. Chem. Soc., 1956, 78, 2055-2060. [all data]
Cox and Pilcher, 1970
Cox, J.D.; Pilcher, G.,
Thermochemistry of Organic and Organometallic Compounds, Academic Press, New York, 1970, 1-636. [all data]
Carlson and Westrum, 1968
Carlson, H.G.; Westrum, E.F., Jr.,
Thermal study of the glass-type transformation of 2-methylthiophene,
J. Chem. Eng. Data, 1968, 13, 273-274. [all data]
Weast and Grasselli, 1989
CRC Handbook of Data on Organic Compounds, 2nd Editon, Weast,R.C and Grasselli, J.G., ed(s)., CRC Press, Inc., Boca Raton, FL, 1989, 1. [all data]
Majer and Svoboda, 1985
Majer, V.; Svoboda, V.,
Enthalpies of Vaporization of Organic Compounds: A Critical Review and Data Compilation, Blackwell Scientific Publications, Oxford, 1985, 300. [all data]
Levi and Nicholls, 1958
Levi, L.; Nicholls, R.V.V.,
Formation of Styrene by Pyrolysis of Aromatic Heterocyclic Aldehyde- Aliphatic Acid Anhydride Mixtures on Morden Bentonite,
Ind. Eng. Chem., 1958, 50, 1005. [all data]
Haines, Helm, et al., 1956
Haines, W.E.; Helm, R.V.; Cook, G.L.; Ball, J.S.,
Purification and Properties of Organic Sulfur Compounds,
J. Phys. Chem., 1956, 60, 549-55. [all data]
Pennington, Finke, et al., 1956, 2
Pennington, R.E.; Finke, H.L.; Hubbard, W.N.; Messerly, J.F.; Frow, F.R.; Hossenlopp, I.A.; Waddington, G.,
The Chemical Thermodynamic Properties of 2-Methylthiophene,
J. Am. Chem. Soc., 1956, 78, 2055-60. [all data]
Reid, 1972
Reid, Robert C.,
Handbook on vapor pressure and heats of vaporization of hydrocarbons and related compounds, R. C. Wilhort and B. J. Zwolinski, Texas A Research Foundation. College Station, Texas(1971). 329 pages.$10.00,
AIChE J., 1972, 18, 6, 1278-1278, https://doi.org/10.1002/aic.690180637
. [all data]
Stephenson and Malanowski, 1987
Stephenson, Richard M.; Malanowski, Stanislaw,
Handbook of the Thermodynamics of Organic Compounds, 1987, https://doi.org/10.1007/978-94-009-3173-2
. [all data]
White, Barnard--Smith, et al., 1952
White, P.T.; Barnard--Smith, D.G.; Fidler, F.A.,
Vapor Pressure--Temperature Relationships of Sulfur Compounds Related to Petroleum,
Ind. Eng. Chem., 1952, 44, 6, 1430-1438, https://doi.org/10.1021/ie50510a064
. [all data]
Dykyj, Svoboda, et al., 1999
Dykyj, J.; Svoboda, J.; Wilhoit, R.C.; Frenkel, M.L.; Hall, K.R.,
Vapor Pressure of Chemicals: Part A. Vapor Pressure and Antoine Constants for Hydrocarbons and Sulfur, Selenium, Tellurium and Hydrogen Containing Organic Compounds, Springer, Berlin, 1999, 373. [all data]
Eon, Pommier, et al., 1971
Eon, C.; Pommier, C.; Guiochon, G.,
Vapor pressures and second virial coefficients of some five-membered heterocyclic derivatives,
J. Chem. Eng. Data, 1971, 16, 4, 408-410, https://doi.org/10.1021/je60051a008
. [all data]
Boublik, Fried, et al., 1984
Boublik, T.; Fried, V.; Hala, E.,
The Vapour Pressures of Pure Substances: Selected Values of the Temperature Dependence of the Vapour Pressures of Some Pure Substances in the Normal and Low Pressure Region, 2nd ed., Elsevier, New York, 1984, 972. [all data]